Methyl-2-iodobenzoate

Van Den Dool and Kratz RI, non-polar column, temperature ramp

Data compiled by: NIST Mass Spectrometry Data Center, William E. Wallace, director

Column type Packed
Active phase SE-30
Column length (m) 3.05
Carrier gas He
Substrate Supelcoport and Chromosorb
Column diameter (mm)
Phase thickness (μm)
Tstart (C) 40.
Tend (C) 250.
Heat rate (K/min) 10.
Initial hold (min) 4.
Final hold (min) 60.
I 1439.
ReferencePeng, Ding, et al., 1988
Comment MSDC-RI

References

Peng, Ding, et al., 1988
Peng, C.T.; Ding, S.F.; Hua, R.L.; Yang, Z.C., Prediction of Retention Indexes I. Structure-Retention Index Relationship on Apolar Columns, J. Chromatogr., 1988, 436, 137-172, https://doi.org/10.1016/S0021-9673(00)94575-8 . [all data]