Spiro[4.5]dec-8-en-7-ol, 4,8-dimethyl-1-(1-methylethyl)-

Normal alkane RI, non-polar column, custom temperature program

View large format table.

Column type Active phase I Reference Comment
CapillaryHP-51673.Citron, Riclea, et al., 2011Program: not specified

References

Citron, Riclea, et al., 2011
Citron, C.A.; Riclea, R.; Brock, N.L.; Dickschat, J.S., Biosynthesis of acorane sesquiterpenes by Trichoderma. Electronic supplemental materials (ESI), Royal Soc. Chem., 2011, 1-10. [all data]