Mercury, methyl (norborn-2-yl)-, exo-

Gas phase ion energetics data

Data compiled by: Sharon G. Lias, Rhoda D. Levin, and Sherif A. Kafafi

Ionization energy determinations

IE (eV) Method Reference Comment
8.28PENugent, Wu, et al., 1976Vertical value

References

Nugent, Wu, et al., 1976
Nugent, W.A.; Wu, M.M.-H.; Fehlner, T.P.; Kochi, J.K., Enhanced reactivity of exo-norbornyl derivatives. Evidence for σ-participation in the absence of steric effects, J. Chem. Soc., Chem. Commun., 1976, 456. [all data]