Fe2S2 radical

Gas phase ion energetics data

Data compiled by: John E. Bartmess

Electron affinity determinations

EA (eV) Method Reference Comment
2.150 ± 0.080LPESNakajima, Hayase, et al., 1997Vertical Detachment Energy: 2.39±.13 eV
1.37 ± 0.10LPESZhang, Hayase, et al., 1996Vertical Detachment Energy: 1.71±0.17 eV

References

Nakajima, Hayase, et al., 1997
Nakajima, A.; Hayase, T.; Hayakawa, F.; Kaya, K., Study on Iron-Sulfur Cluster in the Gas-phase: Electronic Structure and Reactivity, Chem. Phys. Lett., 1997, 280, 3-4, 381, https://doi.org/10.1016/S0009-2614(97)01162-7 . [all data]

Zhang, Hayase, et al., 1996
Zhang, N.; Hayase, T.; Kawamata, H.; Nakao, K.; Nakajima, A.; Kaya, K., Photoelectron spectroscopy of iron-sulfur cluster anions, J. Chem. Phys., 1996, 104, 10, 3413-3419, https://doi.org/10.1063/1.471048 . [all data]