Promethazine

Van Den Dool and Kratz RI, non-polar column, temperature ramp

Data compiled by: NIST Mass Spectrometry Data Center, William E. Wallace, director

Column type CapillaryCapillaryCapillaryCapillaryPacked
Active phase CBP-1DB-1DB-1SE-30SE-30
Column length (m) 12.15.15.15.1.8
Carrier gas N2HeHeHeN2
Substrate     Chromosorb W
Column diameter (mm) 0.530.320.250.25
Phase thickness (μm)  0.250.250.25
Tstart (C) 120.120.120.100.130.
Tend (C) 250.280.280.295.290.
Heat rate (K/min) 6.8.8.5.8.
Initial hold (min)     2.
Final hold (min)  5.5. 8.
I 2260.2254.2254.2234.2280.
ReferenceOyama, Sano, et al., 1987Perrigo, Peel, et al., 1985Perrigo, Ballantyne, et al., 1984Anderson and Stafford, 1983Perrigo and Peel, 1981
Comment MSDC-RI MSDC-RI MSDC-RI MSDC-RI MSDC-RI

Kovats' RI, non-polar column, temperature ramp

Data compiled by: NIST Mass Spectrometry Data Center, William E. Wallace, director

Column type PackedCapillary
Active phase OV-101SE-30
Column length (m) 0.625.
Carrier gas N2
Substrate Chromosorb G HP
Column diameter (mm)  0.49
Phase thickness (μm)  1.14
Tstart (C) 100.100.
Tend (C) 310.275.
Heat rate (K/min) 30.8.
Initial hold (min) 3.2.
Final hold (min) 5.15.
I 2270.2276.
ReferenceMaurer and Pfleger, 1988Schepers, Wijsbeek, et al., 1982
Comment MSDC-RI MSDC-RI

Kovats' RI, non-polar column, isothermal

Data compiled by: NIST Mass Spectrometry Data Center, William E. Wallace, director

Column type Packed
Active phase SE-30
Column length (m) 2.
Carrier gas N2
Substrate 1% se-30 on Anachrom ABS(80-100mesh)
Column diameter (mm)
Phase thickness (μm)
Temperature (C) 220.
I 2256.
ReferenceMusumarra, Scarlata, et al., 1987
Comment MSDC-RI

Normal alkane RI, non-polar column, custom temperature program

Data compiled by: NIST Mass Spectrometry Data Center, William E. Wallace, director

Column type Other
Active phase Methyl Silicone
Column length (m)
Carrier gas
Substrate
Column diameter (mm)
Phase thickness (μm)
Program not specified
I 2259.
ReferenceArdrey and Moffat, 1981
Comment MSDC-RI

References

Oyama, Sano, et al., 1987
Oyama, N.; Sano, T.; Syoyama, M.; Maeda, K., Studies on systematic analysis of poisonous compounds in forensic chemistry. II. Application of capillary column gas chromatography to substance identification by means of retention indices, Eisei Kagaku, 1987, 33, 5, 342-348, https://doi.org/10.1248/jhs1956.33.342 . [all data]

Perrigo, Peel, et al., 1985
Perrigo, B.J.; Peel, H.W.; Ballantyne, D.J., Use of Dual-Column Fused-Silica Capillary Gas Chromatography in Combination with Detector Response Factors for Analytical Toxicology., J. Chromatogr., 1985, 341, 81-88, https://doi.org/10.1016/S0378-4347(00)84011-6 . [all data]

Perrigo, Ballantyne, et al., 1984
Perrigo, B.J.; Ballantyne, D.J.; Peel, H.W., Condierations in developing a data base for drugs on a DBI capillary column, J. Can. Soc. Forensic Sci., 1984, 17, 2, 41-49, https://doi.org/10.1080/00085030.1984.10757360 . [all data]

Anderson and Stafford, 1983
Anderson, W.H.; Stafford, D.T., Applications of capillary gas chromatography in routine toxicological analyses, J. Hi. Res. Chromatogr. Chromatogr. Comm., 1983, 6, 5, 247-254, https://doi.org/10.1002/jhrc.1240060506 . [all data]

Perrigo and Peel, 1981
Perrigo, B.J.; Peel, H.W., The use of retention indices and temperature-programmed gas chromatography in analytical toxicology, J. Chromatogr. Sci., 1981, 19, 5, 219-226, https://doi.org/10.1093/chromsci/19.5.219 . [all data]