Phenol, 2,6-dibromo-

Van Den Dool and Kratz RI, non-polar column, temperature ramp

Data compiled by: NIST Mass Spectrometry Data Center, William E. Wallace, director

Column type CapillaryCapillaryPacked
Active phase DB-5DB-5SE-30
Column length (m) 60.60.3.05
Carrier gas   He
Substrate   Supelcoport and Chromosorb
Column diameter (mm) 0.250.25
Phase thickness (μm) 0.250.25
Tstart (C) 40.40.40.
Tend (C) 275.275.250.
Heat rate (K/min) 7.7.10.
Initial hold (min)   4.
Final hold (min)   60.
I 1378.1386.1333.
ReferenceGocmen, Elston, et al., 2005Gocmen, Elston, et al., 2005Peng, Ding, et al., 1988
Comment MSDC-RI MSDC-RI MSDC-RI

References

Gocmen, Elston, et al., 2005
Gocmen, D.; Elston, A.; Williams, T.; Parish, M.; Rouseff, R.L., Identification of medicinal off-flavours generated by Alicyclobacillus species in orange juice using GC-olfactometry and GC-MS, Lett. Appl. Microbiol., 2005, 40, 3, 172-177, https://doi.org/10.1111/j.1472-765X.2004.01636.x . [all data]

Peng, Ding, et al., 1988
Peng, C.T.; Ding, S.F.; Hua, R.L.; Yang, Z.C., Prediction of Retention Indexes I. Structure-Retention Index Relationship on Apolar Columns, J. Chromatogr., 1988, 436, 137-172, https://doi.org/10.1016/S0021-9673(00)94575-8 . [all data]