3-Nonanol, acetate

Kovats' RI, non-polar column, isothermal

View large format table.

Column type Active phase Temperature (C) I Reference Comment
PackedApiezon L100.1165.Singliar, 1972Column length: 2.55 m

References

Singliar, 1972
Singliar, M., Chromatographic Behaviour and the Structure of Secondary Aliphatic Alcohols, J. Chromatogr., 1972, 65, 1, 311-321, https://doi.org/10.1016/S0021-9673(00)86946-0 . [all data]