1,3-Benzenediol, 2-methyl-

Phase change data

Data compiled as indicated in comments:
BS - Robert L. Brown and Stephen E. Stein
AC - William E. Acree, Jr., James S. Chickos

Quantity Value Units Method Reference Comment
Tboil537.2KN/AWeast and Grasselli, 1989BS
Quantity Value Units Method Reference Comment
Δsub99.2 ± 2.3kJ/molMERibeiro da Silva and Lobo Ferreira, 2009Based on data from 309. - 329. K.; AC

Reduced pressure boiling point

Tboil (K) Pressure (bar) Reference Comment
441.20.021Weast and Grasselli, 1989BS

Enthalpy of vaporization

ΔvapH (kJ/mol) Temperature (K) Method Reference Comment
66.9413.A,GCStephenson and Malanowski, 1987Based on data from 398. - 434. K. See also Kundel, Lille, et al., 1975.; AC

Enthalpy of sublimation

ΔsubH (kJ/mol) Temperature (K) Method Reference Comment
98.8 ± 0.3319.MERibeiro da Silva and Lobo Ferreira, 2009Based on data from 309. - 329. K.; AC

References

Weast and Grasselli, 1989
CRC Handbook of Data on Organic Compounds, 2nd Editon, Weast,R.C and Grasselli, J.G., ed(s)., CRC Press, Inc., Boca Raton, FL, 1989, 1. [all data]

Ribeiro da Silva and Lobo Ferreira, 2009
Ribeiro da Silva, Manuel A.V.; Lobo Ferreira, Ana I.M.C., Experimental standard molar enthalpies of formation of some methylbenzenediol isomers, The Journal of Chemical Thermodynamics, 2009, 41, 10, 1096-1103, https://doi.org/10.1016/j.jct.2009.04.015 . [all data]

Stephenson and Malanowski, 1987
Stephenson, Richard M.; Malanowski, Stanislaw, Handbook of the Thermodynamics of Organic Compounds, 1987, https://doi.org/10.1007/978-94-009-3173-2 . [all data]

Kundel, Lille, et al., 1975
Kundel, H.; Lille, U.; Kaidas, N., Tr. Tallin. Politekh. Inst., 1975, 390, 107. [all data]