1-Methoxyethyl allyl ether

Reaction thermochemistry data

Data compiled by: Hussein Y. Afeefy, Joel F. Liebman, and Stephen E. Stein

Individual Reactions

1-Methoxyethyl allyl ether = 1-Propene, 1-(1-methoxyethoxy)-, (Z)-

By formula: C6H12O2 = C6H12O2

Quantity Value Units Method Reference Comment
Δr-21.4 ± 0.3kJ/molEqkTaskinen, 1993liquid phase; solvent: DMSO; Isomerization

References

Taskinen, 1993
Taskinen, E., Relative thermodynamic stabilities of isomeric alkyl allyl and alkyl (Z)-propenyl ethers, Tetrahedron, 1993, 49, 11389-11394. [all data]