Rhodium fluoride

Ion clustering data

Data compiled by: John E. Bartmess

Clustering reactions

Fluorine anion + F3Rh = (Fluorine anion • F3Rh)

By formula: F- + F3Rh = (F- • F3Rh)

Quantity Value Units Method Reference Comment
Δr95.8 ± 3.4kcal/molTDEqChilingarov, Korobov, et al., 1984gas phase; Fluoride Affinity: 5.3 kcal <MnF3

References

Chilingarov, Korobov, et al., 1984
Chilingarov, N.S.; Korobov, M.V.; Sidirov, L.N.; Mitkin, V.N.; Shipachev, V.A.; Zemskov, S.V., Electron affinity of rhodium tetrafluoride, J. Chem. Thermodyn., 1984, 16, 965. [all data]