1,3-Benzodioxole, 4-methoxy-6-(2-propenyl)-

Van Den Dool and Kratz RI, polar column, temperature ramp

Data compiled by: NIST Mass Spectrometry Data Center, William E. Wallace, director

Column type CapillaryCapillaryCapillaryCapillaryCapillary
Active phase DB-FFAPCP-Wax 52CBCP-Wax 52CBCP-Wax 52CBCP-Wax 52CB
Column length (m) 30.50.50.50.50.
Carrier gas HeHe
Substrate
Column diameter (mm) 0.320.250.250.320.32
Phase thickness (μm) 0.250.20.2
Tstart (C) 40.32.32.60.60.
Tend (C) 230.220.220.220.220.
Heat rate (K/min) 6.1.1.4.4.
Initial hold (min) 1.1.1.5.5.
Final hold (min)    30.30.
I 2272.2225.2225.2247.2262.
ReferenceZeller and Rychlik, 2006Kjeldsen, Christensen, et al., 2003Kjeldsen, Christensen, et al., 2001Chevance and Farmer, 1999Chevance and Farmer, 1999, 2
Comment MSDC-RI MSDC-RI MSDC-RI MSDC-RI MSDC-RI
Column type Capillary
Active phase CP-Wax 52CB
Column length (m) 50.
Carrier gas
Substrate
Column diameter (mm) 0.32
Phase thickness (μm)
Tstart (C) 40.
Tend (C) 220.
Heat rate (K/min) 4.
Initial hold (min) 5.
Final hold (min) 30.
I 2262.
ReferenceChevance and Farmer, 1999, 2
Comment MSDC-RI

Normal alkane RI, polar column, custom temperature program

Data compiled by: NIST Mass Spectrometry Data Center, William E. Wallace, director

Column type CapillaryCapillaryCapillaryCapillaryCapillary
Active phase PEG-20M InnowaxHP-Innowax FSCInnowax FSCInnowax FSCInnowax
Column length (m) 30.60.60.60.60.
Carrier gas NitrogenHeHeHeHe
Substrate
Column diameter (mm) 0.250.250.250.250.25
Phase thickness (μm) 0.250.250.250.250.25
Program 50 0C (7 min) 20 0C/min -> 130 0C (1 min) 1 0C/min -> 150 0C 8 0C/min -> 190 0C (5 min)60C(10min) => 4C/min => 220C (10min) => 1C/min => 240C60C(10min) => 4C/min => 220C(10min) => 1C/min => 240C60C(10min) => 4C/min => 220C(10min) => 1C/min => 240C60C(10min) => 4C/min => 200C(10min) => 1C/min => 240C
I 2286.2296.2296.2296.2296.
ReferenceWang, Tian, et al., 2013Kürkçüoglu, Hüsnü Can Baser, et al., 2006Kosar, Özek, et al., 2005Kosar, Özek, et al., 2005Özcan, Akgül, et al., 2001
Comment MSDC-RI MSDC-RI MSDC-RI MSDC-RI MSDC-RI

References

Zeller and Rychlik, 2006
Zeller, A.; Rychlik, M., Character impact odorants of fennel fruits and fennel tea, J. Agric. Food Chem., 2006, 54, 10, 3686-3692, https://doi.org/10.1021/jf052944j . [all data]

Kjeldsen, Christensen, et al., 2003
Kjeldsen, F.; Christensen, L.P.; Edelenbos, M., Changes in volatile compounds of carrots (Daucus carota L.) during refrigerated and frozen storage, J. Agric. Food Chem., 2003, 51, 18, 5400-5407, https://doi.org/10.1021/jf030212q . [all data]

Kjeldsen, Christensen, et al., 2001
Kjeldsen, F.; Christensen, L.P.; Edelenbos, M., Quantitative analysis of aroma compounds in carrot (Daucus carota L.) cultivars by capillary gas chromatography using large-volume injection technique, J. Agric. Food Chem., 2001, 49, 9, 4342-4348, https://doi.org/10.1021/jf010213n . [all data]

Chevance and Farmer, 1999
Chevance, F.F.V.; Farmer, L.J., Identification of major volatile odor compounds in frankfurters, J. Agric. Food Chem., 1999, 47, 12, 5151-5160, https://doi.org/10.1021/jf990515d . [all data]

Chevance and Farmer, 1999, 2
Chevance, F.F.V.; Farmer, L.J., Release of volatile odor compounds from full-fat and reduced-fat frankfurters, J. Agric. Food Chem., 1999, 47, 12, 5161-5168, https://doi.org/10.1021/jf9905166 . [all data]