2-Nonenal, (Z)-

Van Den Dool and Kratz RI, polar column, custom temperature program

Data compiled by: NIST Mass Spectrometry Data Center, William E. Wallace, director

Column type CapillaryCapillaryCapillaryCapillaryCapillary
Active phase FFAPFFAPFFAPFFAPDB-FFAP
Column length (m) 25.30.30.30.30.
Carrier gas HeHeHeHeHe
Substrate
Column diameter (mm) 0.320.250.320.320.25
Phase thickness (μm) 0.30.250.250.250.25
Program 35C(2min) => 5C/min => 170C => 20C/min => 240C (10min)40C(1min) => 40C/min => 50C(2min) => 6C/min => 240C35C (2min) => 60C/min => 50C (2min) => 6C/min => 240C (10min)35C (2min) => 60C/min => 50C (2min) => 6C/min => 240C (10min)35 0C (2 min) 40 K/min -> 60 0C (2 min) 6 K/min -> 230 0C
I 1500.1500.1496.1496.1499.
ReferenceFuhrmann and Grosch, 2002Jezussek, Juliano, et al., 2002Kirchhoff and Schieberle, 2002Kirchhoff and Schieberle, 2002Zehentbauer and Reineccius, 2002
Comment MSDC-RI MSDC-RI MSDC-RI MSDC-RI MSDC-RI
Column type CapillaryCapillaryCapillaryCapillaryCapillary
Active phase FFAPDB-FFAPDB-FFAPDB-FFAPFFAP
Column length (m) 30.30.30.30.30.
Carrier gas He   He
Substrate
Column diameter (mm) 0.320.320.320.320.32
Phase thickness (μm) 0.250.250.250.250.25
Program 40C(2min) => 40C/min => 60C(2min) => 6C/min => 240C(10min)40C(2min) => 40C/min => 60C (2min) => 6C/min => 180C => 10C/min => 240C(5min)40C(2min) => 40C/min => 60C (2min) => 6C/min => 180C => 10C/min => 240C (5min)40C(2min) => 40C/min => 60C (2min) => 6C/min => 180C => 10C/min => 240C (5min)35C (2min) => 40C/min => 60C (2min) => 6C/min => 180C => 10C/min => 230C (10min)
I 1496.1504.1481.1480.1500.
ReferenceKirchhoff and Schieberle, 2001Munk, Johansen, et al., 2001Munk, Munch, et al., 2000Munk, Munch, et al., 2000Buettner and Schieberle, 1999
Comment MSDC-RI MSDC-RI MSDC-RI MSDC-RI MSDC-RI
Column type CapillaryCapillaryCapillary
Active phase FFAPDB-FFAPFFAP
Column length (m) 30.30.30.
Carrier gas HeHeHe
Substrate
Column diameter (mm) 0.320.320.32
Phase thickness (μm) 0.250.250.25
Program 35C (2min) => 40C/min => 60C => 4C/min => 230C (10min)40C(2min) => 40C/min => 60C(2min) => 6C/min => 230C(10min)35C(2min) => 40C/min => 60C(2min) => 6C/min => 180C => 10C/min => 230C(10 min)
I 1532.1495.1502.
ReferenceDerail, Hofmann, et al., 1999Mutti and Grosch, 1999Hinterholzer, Lemos, et al., 1998
Comment MSDC-RI MSDC-RI MSDC-RI

References

Fuhrmann and Grosch, 2002
Fuhrmann, E.; Grosch, W., Character impact odorants of the apple cultivars Elstar and Cox Orange, Nahrung/Food, 2002, 46, 3, 187-193, https://doi.org/10.1002/1521-3803(20020501)46:3<187::AID-FOOD187>3.0.CO;2-5 . [all data]

Jezussek, Juliano, et al., 2002
Jezussek, M.; Juliano, B.O.; Schieberle, P., Comparison of key aroma compounds in cooked brown rice varieties based on aroma extract dilution analysis, J. Agric. Food Chem., 2002, 50, 5, 1101-1105, https://doi.org/10.1021/jf0108720 . [all data]

Kirchhoff and Schieberle, 2002
Kirchhoff, E.; Schieberle, P., Quantitation of odor-active compounds in rye flour and rye sourdough using stable isotope dilution assays, J. Agric. Food Chem., 2002, 50, 19, 5378-5385, https://doi.org/10.1021/jf020236h . [all data]

Zehentbauer and Reineccius, 2002
Zehentbauer, G.; Reineccius, G.A., Determination of key aroma components of cheddar cheese using dynamic headspace dilution assay, Flavour Fragr. J., 2002, 17, 4, 300-305, https://doi.org/10.1002/ffj.1102 . [all data]

Kirchhoff and Schieberle, 2001
Kirchhoff, E.; Schieberle, P., Determination of key aroma compounds in the crumb of a three-stage sourdough rye bread by stable isotope dilution assays and sensory studies, J. Agric. Food Chem., 2001, 49, 9, 4304-4311, https://doi.org/10.1021/jf010376b . [all data]

Munk, Johansen, et al., 2001
Munk, S.; Johansen, C.; Stahnke, L.H.; Adler-Nissen, J., Microbial survival and odor in laundry, Journal of Surfactants and Detergents, 2001, 4, 4, 385-394, https://doi.org/10.1007/s11743-001-0192-2 . [all data]

Munk, Munch, et al., 2000
Munk, S.; Munch, P.; Stahnke, L.; Adler-Nissen., J.; Schieberle, P., Primary odorants of laundry soiled with sweat/sebum: influence of lipase on the odor profile, Journal of Surfactants and Detergents, 2000, 3, 4, 505-515, https://doi.org/10.1007/s11743-000-0150-z . [all data]

Buettner and Schieberle, 1999
Buettner, A.; Schieberle, P., Characterization of the most odor-active volatiles in fresh, hand squeezed juice of grapefruit (Citrus paradise Macfayden), J. Agric. Food Chem., 1999, 47, 12, 5189-5193, https://doi.org/10.1021/jf990071l . [all data]

Derail, Hofmann, et al., 1999
Derail, C.; Hofmann, T.; Schieberle, P., Differences in key odorants of handmade juice of yellow-flesh peaches (Prunus persica L.) induced by the workup procedure, J. Agric. Food Chem., 1999, 47, 11, 4742-4745, https://doi.org/10.1021/jf990459g . [all data]

Mutti and Grosch, 1999
Mutti, B.; Grosch, W., Potent odorants of boiled potatoes, Nahrung, 1999, 43, 5, 302-306, https://doi.org/10.1002/(SICI)1521-3803(19991001)43:5<302::AID-FOOD302>3.0.CO;2-8 . [all data]

Hinterholzer, Lemos, et al., 1998
Hinterholzer, A.; Lemos, T.; Schieberle, P., Identification of the key odorants in raw French beans and changes during cooking, Z. Lebensm. Unters. Forsch. A, 1998, 207, 3, 219-222, https://doi.org/10.1007/s002170050322 . [all data]