1,3,2-Diazaborolidine,1-methyl-2-phenyl-

Gas phase ion energetics data

Data compiled by: Sharon G. Lias, Rhoda D. Levin, and Sherif A. Kafafi

Ionization energy determinations

IE (eV) Method Reference Comment
7.91PEKroner, Noth, et al., 1974Vertical value

References

Kroner, Noth, et al., 1974
Kroner, J.; Noth, H.; Niedenzu, K., Photoelektronenspektroskopische untersuchungen an bor-verbindungen. III. π-elektronendelokalisation in 1,3,2-diazaborolinen, J. Organomet. Chem., 1974, 71, 165. [all data]