1,3,2-Diazaphospholidine-2-amine, N,N',N'',N''-tetramethyl-

Gas phase ion energetics data

Data compiled as indicated in comments:
LBLHLM - Sharon G. Lias, John E. Bartmess, Joel F. Liebman, John L. Holmes, Rhoda D. Levin, and W. Gary Mallard
LLK - Sharon G. Lias, Rhoda D. Levin, and Sherif A. Kafafi

Ionization energy determinations

IE (eV) Method Reference Comment
7.1PEWorley, Hargis, et al., 1982LBLHLM
7.61PEWorley, Hargis, et al., 1982Vertical value; LBLHLM
7.61PEWorley, Hargis, et al., 1979Vertical value; LLK

References

Worley, Hargis, et al., 1982
Worley, S.D.; Hargis, J.H.; Chang, L.; Mattson, G.A.; Jennings, W.B., The UPS of some compounds containing the heteroatoms phosphorus, nitrogen and oxygen, J. Electron Spectrosc. Relat. Phenom., 1982, 25, 135. [all data]

Worley, Hargis, et al., 1979
Worley, S.D.; Hargis, J.H.; Chang, L.; Mattson, G.A.; Jennings, W.B., A study of the electronic structure of 2-(dialkyl-amino)-1,3-dimethyl-1,3,2-diazaphospholanes related and molecules, Inorg. Chem., 1979, 18, 3581. [all data]