benzyldiphenylamine

Condensed phase thermochemistry data

Data compiled by: Hussein Y. Afeefy, Joel F. Liebman, and Stephen E. Stein

Quantity Value Units Method Reference Comment
Δfsolid185. ± 10.kJ/molCcbTavernier and Lamouroux, 1956Reanalyzed by Pedley, Naylor, et al., 1986, Original value = 202.1 kJ/mol
Quantity Value Units Method Reference Comment
Δcsolid-10091. ± 10.kJ/molCcbTavernier and Lamouroux, 1956Reanalyzed by Pedley, Naylor, et al., 1986, Original value = -10108.45 kJ/mol

References

Tavernier and Lamouroux, 1956
Tavernier, P.; Lamouroux, M., Determinations calorimetriques relatives a vingt-six substances organiques, Mem. Poudres, 1956, 38, 65-88. [all data]

Pedley, Naylor, et al., 1986
Pedley, J.B.; Naylor, R.D.; Kirby, S.P., Thermochemical Data of Organic Compounds, Chapman and Hall, New York, 1986, 1-792. [all data]