1H-Azepine, hexahydro-1-(pyrrolidinyl-)

Gas phase ion energetics data

Data compiled as indicated in comments:
LBLHLM - Sharon G. Lias, John E. Bartmess, Joel F. Liebman, John L. Holmes, Rhoda D. Levin, and W. Gary Mallard
LLK - Sharon G. Lias, Rhoda D. Levin, and Sherif A. Kafafi

Ionization energy determinations

IE (eV) Method Reference Comment
8.12PENelsen, 1984Vertical value; LBLHLM
7.60PENelsen, Peacock, et al., 1976Vertical value; LLK

References

Nelsen, 1984
Nelsen, S.F., Ionization from nitrogen and oxygen lone pairs: A comparison of trialkylamine, dialkyl ether, tetraalkylhydrazine, and dialkyl peroxide photoelectron spectroscopic ionization potentials, J. Org. Chem., 1984, 49, 1891. [all data]

Nelsen, Peacock, et al., 1976
Nelsen, S.F.; Peacock, V.; Weisman, G.R., Single-electron oxidation equilibria of tetraalkylhydrazines. Comparison of solution E° values and vapor-phase ionization potentials, J. Am. Chem. Soc., 1976, 98, 5269. [all data]