Silica, vitreous

Condensed phase thermochemistry data

Quantity Value Units Method Reference Comment
Δfsolid-910.7 ± 1.0kJ/molReviewCox, Wagman, et al., 1984 alpha-quartz phase; CODATA Review value
Quantity Value Units Method Reference Comment
solid,1 bar41.46 ± 0.20J/mol*KReviewCox, Wagman, et al., 1984 alpha-quartz phase; CODATA Review value

Gas phase ion energetics data

Data compiled by: John E. Bartmess

Electron affinity determinations

EA (eV) Method Reference Comment
2.09999LPESWang, Wu, et al., 1996EA is upper limit to adiabatic EA. Vertical Detachment Energy: 2.76±0.10 eV

References

Cox, Wagman, et al., 1984
Cox, J.D.; Wagman, D.D.; Medvedev, V.A., CODATA Key Values for Thermodynamics, Hemisphere Publishing Corp., New York, 1984, 1. [all data]

Wang, Wu, et al., 1996
Wang, L.S.; Wu, H.; Desai, S.L.; Fan, J.; Colson, S.D., A Photoelectron Spectroscopic Study of Small Silicon Oxide Clusters: SiO2, Si2O3, and Si2O4, J. Phys. Chem., 1996, 100, 21, 8697, https://doi.org/10.1021/jp9602538 . [all data]