3-undecanol, 2-methyl-

Phase change data

Data compiled by: Thermodynamics Research Center, NIST Boulder Laboratories, Chris Muzny director

Quantity Value Units Method Reference Comment
Tboil509.15KN/APickard and Kenyon, 1912Uncertainty assigned by TRC = 4. K

In addition to the Thermodynamics Research Center (TRC) data available from this site, much more physical and chemical property data is available from the following TRC products:

References

Pickard and Kenyon, 1912
Pickard, R.H.; Kenyon, J., Investigations on the dependence of rotatory power on chemical constitution: II the rotations of some secondary alcohols containing the isopropyl group, J. Chem. Soc., 1912, 101, 620-38. [all data]