3-Undecene

Normal alkane RI, non-polar column, custom temperature program

View large format table.

Column type Active phase I Reference Comment
CapillaryCP-Sil 8 CB1005.de Freitas, Garruti, et al., 201130. m/0.25 mm/0.25 μm, Hydrogen; Program: 30 0C 3 0C/min -> 150 0C 20 0C/min -> 220 0C

References

de Freitas, Garruti, et al., 2011
de Freitas, V.M.; Garruti, D. dosS.; Souza Neto, M.A.; Facundo, H.V. daV.; Correia, J.M., Stability of volatile profile and sensory properties of passion fruit during storage in glass bottles, Ciencia e Tecnologia de Alimentos, Campinas, 2011, 31, 2, 349-354, https://doi.org/10.1590/S0101-20612011000200011 . [all data]