Dimethylpropanedioic acid dimethyl ester

Condensed phase thermochemistry data

Data compiled as indicated in comments:
ALS - Hussein Y. Afeefy, Joel F. Liebman, and Stephen E. Stein
DH - Eugene S. Domalski and Elizabeth D. Hearing

Quantity Value Units Method Reference Comment
Δfliquid-205.17 ± 0.10kcal/molCcbVerevkin, Dogan, et al., 1990ALS
Quantity Value Units Method Reference Comment
Δcliquid-863.08 ± 0.10kcal/molCcbVerevkin, Dogan, et al., 1990Corresponding Δfliquid = -205.17 kcal/mol (simple calculation by NIST; no Washburn corrections); ALS

Constant pressure heat capacity of liquid

Cp,liquid (cal/mol*K) Temperature (K) Reference Comment
61.97298.15Verevkin, Beckhaus, et al., 1992DH

Phase change data

Data compiled as indicated in comments:
ALS - Hussein Y. Afeefy, Joel F. Liebman, and Stephen E. Stein
DRB - Donald R. Burgess, Jr.
AC - William E. Acree, Jr., James S. Chickos

Quantity Value Units Method Reference Comment
Δvap13.31 ± 0.19kcal/molCVerevkin, Dogan, et al., 1990ALS
Δvap13.3kcal/molN/AVerevkin, Dogan, et al., 1990DRB

Enthalpy of vaporization

ΔvapH (kcal/mol) Temperature (K) Method Reference Comment
13.3 ± 0.2293.GSVerevkin, Beckhaus, et al., 1992Based on data from 278. - 307. K.; AC

References

Verevkin, Dogan, et al., 1990
Verevkin, S.; Dogan, B.; Beckhaus, H.D.; Ruechardt, C., Geminal substituent effects. 3. Synergistic destablization by geminal ester groups, Angew. Chem., 1990, 102, 693-695. [all data]

Verevkin, Beckhaus, et al., 1992
Verevkin, S.P.; Beckhaus, H.-D.; Ruchardt, C., Geminale substituenteneffekte Teil 5α. Standardbildungsenthalpien von alkylsubstituierten Malonsaure- und α-aminocarbonsaureestern, Thermochim. Acta, 1992, 197, 27-39. [all data]