Benzoic acid, 2-methoxy-, methyl ester

Normal alkane RI, non-polar column, temperature ramp

Data compiled by: NIST Mass Spectrometry Data Center, William E. Wallace, director

Column type CapillaryCapillaryCapillaryCapillaryCapillary
Active phase HP-5ZB-5ZB-5DB-1DB-1
Column length (m) 60.60.60.60.15.
Carrier gas HeHeHeHeHe
Substrate
Column diameter (mm) 0.250.250.250.250.25
Phase thickness (μm) 0.250.250.250.250.25
Tstart (C) 60.40.40.50.130.
Tend (C) 250.250.260.250.290.
Heat rate (K/min) 3.6.6.3.510.
Initial hold (min)  7.4.65.1.
Final hold (min)  1.1. 10.
I 1335.1347.1351.1292.1293.
ReferenceBertrand, Comte, et al., 2006Dötterl, Wolfe, et al., 2005Jürgens and Dötterl, 2004Stashenko, Torres, et al., 1995Sharp, 1987
Comment MSDC-RI MSDC-RI MSDC-RI MSDC-RI MSDC-RI
Column type Capillary
Active phase DB-1
Column length (m) 60.
Carrier gas
Substrate
Column diameter (mm) 0.32
Phase thickness (μm)
Tstart (C) 50.
Tend (C) 250.
Heat rate (K/min) 4.
Initial hold (min) 0.1
Final hold (min) 5.
I 1295.
ReferenceFlath, Mon, et al., 1983
Comment MSDC-RI

Normal alkane RI, non-polar column, custom temperature program

Data compiled by: NIST Mass Spectrometry Data Center, William E. Wallace, director

Column type CapillaryCapillaryCapillary
Active phase Siloxane, 5 % PhCP Sil 8 CBHP-1
Column length (m)  30.25.
Carrier gas  He
Substrate
Column diameter (mm)  0.250.25
Phase thickness (μm)  0.250.25
Program not specified50C(3min) => 3C/min => 100C => 2.7C/min => 140C => 2.4C/min => 180C => 6C/min => 250C30 0C (4 min) 6 K/min -> 200 0C 15 K/min -> 250 0C (20 min)
I 1347.1337.1295.
ReferenceVOC BinBase, 2012Meekijjaroenroj, Bessière, et al., 2007Rowland, Blackman, et al., 1995
Comment MSDC-RI MSDC-RI MSDC-RI

Van Den Dool and Kratz RI, polar column, temperature ramp

Data compiled by: NIST Mass Spectrometry Data Center, William E. Wallace, director

Column type CapillaryCapillary
Active phase DB-WaxDB-Wax
Column length (m) 30.60.
Carrier gas He
Substrate
Column diameter (mm) 0.250.25
Phase thickness (μm) 0.250.25
Tstart (C) 50.50.
Tend (C) 220.230.
Heat rate (K/min) 4.2.
Initial hold (min) 4.
Final hold (min) 20.
I 2049.2073.
ReferenceOsorio, Alarcon, et al., 2006Shimoda, Shigematsu, et al., 1995
Comment MSDC-RI MSDC-RI

Phase change data

Data compiled by: Robert L. Brown and Stephen E. Stein

Quantity Value Units Method Reference Comment
Tboil521.2KN/AAldrich Chemical Company Inc., 1990

Reduced pressure boiling point

Tboil (K) Pressure (bar) Reference
400.20.015Weast and Grasselli, 1989

Normal alkane RI, polar column, custom temperature program

Data compiled by: NIST Mass Spectrometry Data Center, William E. Wallace, director

Column type Capillary
Active phase HP Innowax FSP
Column length (m) 60.
Carrier gas He
Substrate
Column diameter (mm) 0.25
Phase thickness (μm) 0.25
Program 60C(10min) => 4C/min => 220C (10min) => 1C/min => 240C
I 2088.
ReferenceTasdemir, Demirci, et al., 2003
Comment MSDC-RI

Kovats' RI, non-polar column, custom temperature program

Data compiled by: NIST Mass Spectrometry Data Center, William E. Wallace, director

Column type Capillary
Active phase DB-1
Column length (m)
Carrier gas
Substrate
Column diameter (mm)
Phase thickness (μm)
Program not specified
I 1298.
ReferenceJenett-Siems, Schimming, et al., 1998
Comment MSDC-RI

References

Bertrand, Comte, et al., 2006
Bertrand, C.; Comte, G.; Piola, F., Solid-phase microextraction of volatile compounds from flowers of two Brunfelsia species, Biochem. Syst. Ecol., 2006, 34, 5, 371-375, https://doi.org/10.1016/j.bse.2005.12.005 . [all data]

Dötterl, Wolfe, et al., 2005
Dötterl, S.; Wolfe, L.M.; Jürgens, A., Qualitative and quantitative analyses of flower scent in Silene latifolia, Phytochemistry, 2005, 66, 2, 203-213, https://doi.org/10.1016/j.phytochem.2004.12.002 . [all data]

Jürgens and Dötterl, 2004
Jürgens, A.; Dötterl, S., Chemical composition of anther volatiles in Ranunculaceae: genera-specific profiles in Aemone, Aquilegia, Caltha, Pulsatilla, Ranunculus, and Trollius species, American Journal of Botany, 2004, 91, 12, 1969-1980, https://doi.org/10.3732/ajb.91.12.1969 . [all data]

Stashenko, Torres, et al., 1995
Stashenko, E.E.; Torres, W.; Morales, J.R.M., A study of the compositional variation of the essential oil of ylang-ylang (Cananga odorata Hook Fil. et Thomson, forma genuina) during flower development, J. Hi. Res. Chromatogr., 1995, 18, 2, 101-104, https://doi.org/10.1002/jhrc.1240180206 . [all data]

Sharp, 1987
Sharp, M.E., A rapid screening procedure for acidic and neutral drugs in blood by high resolution gas chromatography, J. Anal. Toxicol., 1987, 11, 1, 8-11, https://doi.org/10.1093/jat/11.1.8 . [all data]

Flath, Mon, et al., 1983
Flath, R.A.; Mon, T.R.; Lorenz, G.; Whitten, C.J.; Mackley, J.W., Volatile components of Acacia sp. blossoms, J. Agric. Food Chem., 1983, 31, 6, 1167-1170, https://doi.org/10.1021/jf00120a008 . [all data]