Naphthalene, 1,3-dinitro-

Gas phase ion energetics data

Data compiled by: John E. Bartmess

Electron affinity determinations

EA (eV) Method Reference Comment
1.78 ± 0.10IMREHeinis, Chowdhury, et al., 1993ΔGea(423 K)= -39.7 kcal/mol , ΔSea=-3.2 (entropy estimated)
<1.980 ± 0.050PDMock and Grimsrud, 1989

Lee's RI, non-polar column, temperature ramp

View large format table.

Column type Active phase I Reference Comment
CapillarySE-52332.75White, Robbat, et al., 198330. m/0.3 mm/0.25 μm, He, 4. K/min; Tstart: 25. C; Tend: 295. C

Lee's RI, non-polar column, custom temperature program

View large format table.

Column type Active phase I Reference Comment
CapillaryOV-101334.6Tucminen, Wickstrom, et al., 1986Program: not specified

References

Heinis, Chowdhury, et al., 1993
Heinis, T.; Chowdhury, S.; Kebarle, P., Electron Affinities of Naphthalene, Anthracene and Substituted Naphthalenes and Anthracenes, Org. Mass Spectrom., 1993, 28, 4, 358, https://doi.org/10.1002/oms.1210280416 . [all data]

Mock and Grimsrud, 1989
Mock, R.S.; Grimsrud, E.P., Gas-Phase Electron Photodetachment Spectroscopy of the Molecular Anions of Nitroaromatic Hydrocarbons at Atmospheric Pressure, J. Am. Chem. Soc., 1989, 111, 8, 2861, https://doi.org/10.1021/ja00190a020 . [all data]

White, Robbat, et al., 1983
White, C.M.; Robbat, A., Jr.; Hoes, R.M., Gas chromatographic retention characteristics of nitrated polycyclic aromatic hydrocarbons on SE-52, Chromatographia, 1983, 17, 11, 605-612, https://doi.org/10.1007/BF02261944 . [all data]

Tucminen, Wickstrom, et al., 1986
Tucminen, A.; Wickstrom, K.; Pyysalo, H., Determination of Polycyclic Aromatic Compounds by GLC-Selected Ion Monitoring (SIM) Technique, J. Hi. Res. Chromatogr. Chromatogr. Comm., 1986, 9, 8, 469-471, https://doi.org/10.1002/jhrc.1240090813 . [all data]