Dodecane, 6-methyl-

Normal alkane RI, non-polar column, isothermal

Data compiled by: NIST Mass Spectrometry Data Center, William E. Wallace, director

Column type Capillary
Active phase Apiezon L
Column length (m) 2.
Carrier gas
Substrate
Column diameter (mm)
Phase thickness (μm)
Temperature (C) 40. - 190.
I 1247.
ReferenceMann, Mühlstädt, et al., 1967
Comment MSDC-RI

Phase change data

Data compiled by: Thermodynamics Research Center, NIST Boulder Laboratories, Chris Muzny director

Quantity Value Units Method Reference Comment
Tfus215.0KN/APetrov, Sergienko, et al., 1959Uncertainty assigned by TRC = 2. K

In addition to the Thermodynamics Research Center (TRC) data available from this site, much more physical and chemical property data is available from the following TRC products:

References

Mann, Mühlstädt, et al., 1967
Mann, G.; Mühlstädt, M.; Braband, J.; Döring, E., Konformation und physikalische daten von alkanen und cyclanen. II. Einfach und zweifach verzweigte alkane, Tetrahedron, 1967, 23, 8, 3393-3401, https://doi.org/10.1016/S0040-4020(01)92305-1 . [all data]