trans-Perfluorodecalin

Gas phase thermochemistry data

Data compiled by: Hussein Y. Afeefy, Joel F. Liebman, and Stephen E. Stein

Quantity Value Units Method Reference Comment
Δfgas-3644.5 ± 3.9kJ/molCcrZhogina, Papina, et al., 1987

Condensed phase thermochemistry data

Data compiled as indicated in comments:
ALS - Hussein Y. Afeefy, Joel F. Liebman, and Stephen E. Stein
DH - Eugene S. Domalski and Elizabeth D. Hearing

Quantity Value Units Method Reference Comment
Δfliquid-3689.9 ± 3.9kJ/molCcrZhogina, Papina, et al., 1987ALS
Quantity Value Units Method Reference Comment
Δcliquid-3466.7 ± 3.9kJ/molCcrZhogina, Papina, et al., 1987ALS
Quantity Value Units Method Reference Comment
liquid517.1J/mol*KN/AZhogin, Kosarukina, et al., 1981DH

Constant pressure heat capacity of liquid

Cp,liquid (J/mol*K) Temperature (K) Reference Comment
446.8298.15Zhogin, Kosarukina, et al., 1981T = 6 to 310 K.; DH

Phase change data

Data compiled as indicated in comments:
TRC - Thermodynamics Research Center, NIST Boulder Laboratories, Chris Muzny director
AC - William E. Acree, Jr., James S. Chickos
ALS - Hussein Y. Afeefy, Joel F. Liebman, and Stephen E. Stein
DH - Eugene S. Domalski and Elizabeth D. Hearing

Quantity Value Units Method Reference Comment
Ttriple294.61KN/AZhogin, Kosarukina, et al., 1981, 2Uncertainty assigned by TRC = 0.01 K; TRC
Quantity Value Units Method Reference Comment
Δvap45.4 ± 0.1kJ/molCVarushchenko, Druzhinina, et al., 1996AC
Δvap45.4 ± 0.08kJ/molCZhogina, Papina, et al., 1987ALS
Δvap45.9 ± 0.6kJ/molEBVarushchenko, Bulgakova, et al., 1981AC
Δvap45.4 ± 0.1kJ/molCVarushchenko, Bulgakova, et al., 1981AC

Enthalpy of vaporization

ΔvapH (kJ/mol) Temperature (K) Reference Comment
43.3330.Dykyj, Svoboda, et al., 1999Based on data from 315. - 417. K.; AC

Enthalpy of fusion

ΔfusH (kJ/mol) Temperature (K) Reference Comment
17.962294.61Zhogin, Kosarukina, et al., 1981DH
17.96294.6Domalski and Hearing, 1996AC

Entropy of fusion

ΔfusS (J/mol*K) Temperature (K) Reference Comment
61.09294.61Zhogin, Kosarukina, et al., 1981DH

In addition to the Thermodynamics Research Center (TRC) data available from this site, much more physical and chemical property data is available from the following TRC products:

References

Zhogina, Papina, et al., 1987
Zhogina, E.V.; Papina, T.S.; Kolesov, V.P.; Mel'nichenko, B.A.; Zapol'skaya, M.A.; Prokudin, I.P., Standard enthalpies of formation of cis- and trans-perfluorodecalins, Russ. J. Phys. Chem. (Engl. Transl.), 1987, 61, 1523-1525. [all data]

Zhogin, Kosarukina, et al., 1981
Zhogin, D.Yu.; Kosarukina, E.A.; Kolesov, V.P., The heat capacity in the range 6-310 K, phase transformations, and thermodynamic functions of perfluorodecalins, Zhur. Fiz. Khim., 1981, 55, 1955-1960. [all data]

Zhogin, Kosarukina, et al., 1981, 2
Zhogin, D.Yu.; Kosarukina, E.A.; Kolesov, V.P., The heat capacities in the range 6-310 K, phase transformation, and thermodynamic functions of perfluorodecalins, Zh. Fiz. Khim., 1981, 55, 1955. [all data]

Varushchenko, Druzhinina, et al., 1996
Varushchenko, Raisa M.; Druzhinina, Anna I.; Pashchenko, Larisa L., Thermodynamics of vaporization of some cyclic perfluorocarbons, Fluid Phase Equilibria, 1996, 126, 1, 93-104, https://doi.org/10.1016/S0378-3812(96)03111-1 . [all data]

Varushchenko, Bulgakova, et al., 1981
Varushchenko, R.M.; Bulgakova, L.L.; Minzabekyants, P.S.; Makarov, K.N., Russ. J. Phys. Chem., 1981, 55, 1480. [all data]

Dykyj, Svoboda, et al., 1999
Dykyj, J.; Svoboda, J.; Wilhoit, R.C.; Frenkel, M.L.; Hall, K.R., Vapor Pressure of Chemicals: Part A. Vapor Pressure and Antoine Constants for Hydrocarbons and Sulfur, Selenium, Tellurium and Hydrogen Containing Organic Compounds, Springer, Berlin, 1999, 373. [all data]

Domalski and Hearing, 1996
Domalski, Eugene S.; Hearing, Elizabeth D., Heat Capacities and Entropies of Organic Compounds in the Condensed Phase. Volume III, J. Phys. Chem. Ref. Data, 1996, 25, 1, 1, https://doi.org/10.1063/1.555985 . [all data]