Perfluorodecaline, cis-

Phase change data

Data compiled as indicated in comments:
TRC - Thermodynamics Research Center, NIST Boulder Laboratories, Chris Muzny director
AC - William E. Acree, Jr., James S. Chickos
ALS - Hussein Y. Afeefy, Joel F. Liebman, and Stephen E. Stein
DH - Eugene S. Domalski and Elizabeth D. Hearing

Quantity Value Units Method Reference Comment
Ttriple266.70KN/AZhogin, Kosarukina, et al., 1981Crystal phase 1 phase; Uncertainty assigned by TRC = 0.01 K; TRC
Quantity Value Units Method Reference Comment
Δvap46.2 ± 0.1kJ/molCVarushchenko, Druzhinina, et al., 1996AC
Δvap46.19 ± 0.12kJ/molCZhogina, Papina, et al., 1987ALS
Δvap46.7 ± 0.6kJ/molEBVarushchenko, Bulgakova, et al., 1981AC
Δvap46.2 ± 0.1kJ/molCVarushchenko, Bulgakova, et al., 1981AC

Enthalpy of vaporization

ΔvapH (kJ/mol) Temperature (K) Reference Comment
43.9328.Dykyj, Svoboda, et al., 1999Based on data from 313. - 415. K.; AC

Enthalpy of fusion

ΔfusH (kJ/mol) Temperature (K) Reference Comment
10.3266.7Domalski and Hearing, 1996AC

Enthalpy of phase transition

ΔHtrs (kJ/mol) Temperature (K) Initial Phase Final Phase Reference Comment
4.243232.5crystaline, IIcrystaline, IZhogin, Kosarukina, et al., 1981, 2DH
10.305266.70crystaline, IliquidZhogin, Kosarukina, et al., 1981, 2DH

Entropy of phase transition

ΔStrs (J/mol*K) Temperature (K) Initial Phase Final Phase Reference Comment
18.24232.5crystaline, IIcrystaline, IZhogin, Kosarukina, et al., 1981, 2DH
38.62266.70crystaline, IliquidZhogin, Kosarukina, et al., 1981, 2DH

In addition to the Thermodynamics Research Center (TRC) data available from this site, much more physical and chemical property data is available from the following TRC products:

References

Zhogin, Kosarukina, et al., 1981
Zhogin, D.Yu.; Kosarukina, E.A.; Kolesov, V.P., The heat capacities in the range 6-310 K, phase transformation, and thermodynamic functions of perfluorodecalins, Zh. Fiz. Khim., 1981, 55, 1955. [all data]

Varushchenko, Druzhinina, et al., 1996
Varushchenko, Raisa M.; Druzhinina, Anna I.; Pashchenko, Larisa L., Thermodynamics of vaporization of some cyclic perfluorocarbons, Fluid Phase Equilibria, 1996, 126, 1, 93-104, https://doi.org/10.1016/S0378-3812(96)03111-1 . [all data]

Zhogina, Papina, et al., 1987
Zhogina, E.V.; Papina, T.S.; Kolesov, V.P.; Mel'nichenko, B.A.; Zapol'skaya, M.A.; Prokudin, I.P., Standard enthalpies of formation of cis- and trans-perfluorodecalins, Russ. J. Phys. Chem. (Engl. Transl.), 1987, 61, 1523-1525. [all data]

Varushchenko, Bulgakova, et al., 1981
Varushchenko, R.M.; Bulgakova, L.L.; Minzabekyants, P.S.; Makarov, K.N., Russ. J. Phys. Chem., 1981, 55, 1480. [all data]

Dykyj, Svoboda, et al., 1999
Dykyj, J.; Svoboda, J.; Wilhoit, R.C.; Frenkel, M.L.; Hall, K.R., Vapor Pressure of Chemicals: Part A. Vapor Pressure and Antoine Constants for Hydrocarbons and Sulfur, Selenium, Tellurium and Hydrogen Containing Organic Compounds, Springer, Berlin, 1999, 373. [all data]

Domalski and Hearing, 1996
Domalski, Eugene S.; Hearing, Elizabeth D., Heat Capacities and Entropies of Organic Compounds in the Condensed Phase. Volume III, J. Phys. Chem. Ref. Data, 1996, 25, 1, 1, https://doi.org/10.1063/1.555985 . [all data]

Zhogin, Kosarukina, et al., 1981, 2
Zhogin, D.Yu.; Kosarukina, E.A.; Kolesov, V.P., The heat capacity in the range 6-310 K, phase transformations, and thermodynamic functions of perfluorodecalins, Zhur. Fiz. Khim., 1981, 55, 1955-1960. [all data]