Lithium sodium oxide

Gas phase thermochemistry data

Quantity Value Units Method Reference Comment
Δfgas-25.000kcal/molReviewChase, 1998Data last reviewed in June, 1961
Quantity Value Units Method Reference Comment
gas,1 bar61.293cal/mol*KReviewChase, 1998Data last reviewed in June, 1961

Gas Phase Heat Capacity (Shomate Equation)

Cp° = A + B*t + C*t2 + D*t3 + E/t2
H° − H°298.15= A*t + B*t2/2 + C*t3/3 + D*t4/4 − E/t + F − H
S° = A*ln(t) + B*t + C*t2/2 + D*t3/3 − E/(2*t2) + G
    Cp = heat capacity (cal/mol*K)
    H° = standard enthalpy (kcal/mol)
    S° = standard entropy (cal/mol*K)
    t = temperature (K) / 1000.

View plot Requires a JavaScript / HTML 5 canvas capable browser.

View table.

Temperature (K) 298. - 1100.1100. - 6000.
A 7.04842113.84290
B 16.211600.037645
C -14.68140-0.007607
D 4.7396900.000526
E -0.036419-0.588784
F -27.82421-30.79030
G 65.3962075.53700
H -25.00000-25.00000
ReferenceChase, 1998Chase, 1998
Comment Data last reviewed in June, 1961 Data last reviewed in June, 1961

References

Chase, 1998
Chase, M.W., Jr., NIST-JANAF Themochemical Tables, Fourth Edition, J. Phys. Chem. Ref. Data, Monograph 9, 1998, 1-1951. [all data]