S11

Gas phase ion energetics data

Data compiled by: John E. Bartmess

Electron affinity determinations

EA (eV) Method Reference Comment
3.43 ± 0.10LPDHunsicker, Jones, et al., 1995Vertical Detachment Energy: 3.75 eV.

References

Hunsicker, Jones, et al., 1995
Hunsicker, S.; Jones, R.O.; Gantefor, G., Rings and chains in sulfur cluster anions S- to S-9(-): Theory (simulated annealing) and experiment (photoelectron detachment), J. Chem. Phys., 1995, 102, 15, 5917, https://doi.org/10.1063/1.469326 . [all data]