2,2',4,4',5,-Penabromodiphenyl ether

Phase change data

Data compiled by: William E. Acree, Jr., James S. Chickos

Enthalpy of vaporization

ΔvapH (kJ/mol) Temperature (K) Method Reference Comment
104.8405. - 475.CGCTittlemier and Tomy, 2001
100.3418.GCWong, Lei, et al., 2001Based on data from 363. - 473. K.

References

Tittlemier and Tomy, 2001
Tittlemier, Sheryl A.; Tomy, Gregg T., Vapor pressures of six brominated diphenyl ether congeners, Environ Toxicol Chem, 2001, 20, 1, 146-148, https://doi.org/10.1002/etc.5620200116 . [all data]

Wong, Lei, et al., 2001
Wong, Alexander; Lei, Ying Duan; Alaee, Mehran; Wania, Frank, Vapor Pressures of the Polybrominated Diphenyl Ethers, J. Chem. Eng. Data, 2001, 46, 2, 239-242, https://doi.org/10.1021/je0002181 . [all data]