Rinderine

Normal alkane RI, non-polar column, custom temperature program

Data compiled by: NIST Mass Spectrometry Data Center, William E. Wallace, director

Column type CapillaryCapillary
Active phase DB-1DB-1
Column length (m) 30.30.
Carrier gas  He
Substrate
Column diameter (mm) 0.320.3
Phase thickness (μm)
Program not specified120C => (6C/min or 1.5C/min) => 300C
I 2152.2152.
ReferenceFrolich, Ober, et al., 2007Asres, Sporer, et al., 2004
Comment MSDC-RI MSDC-RI

References

Frolich, Ober, et al., 2007
Frolich, C.; Ober, D.; Hartmann, T., Tissue distribution, core biosynthesis and diversification of pyrrolizidine alkaloids of the lycopsamine type in three Boraginaceae species, Phytochemistry, 2007, 68, 7, 1026-1037, https://doi.org/10.1016/j.phytochem.2007.01.002 . [all data]

Asres, Sporer, et al., 2004
Asres, K.; Sporer, F.; Wink, M., Patterns of pyrrolizidine alkaloids in 12 Ethiopian Crotalaria species, Biochem. Syst. Ecol., 2004, 32, 10, 915-930, https://doi.org/10.1016/j.bse.2004.03.004 . [all data]