CAS Reg. No. 60291-30-7

Reaction thermochemistry data

Data compiled by: John E. Bartmess

Individual Reactions

(CAS Reg. No. 60291-30-7 • 4294967295Methylene) + Methylene = CAS Reg. No. 60291-30-7

By formula: (CAS Reg. No. 60291-30-7 • 4294967295CH2) + CH2 = CAS Reg. No. 60291-30-7

Quantity Value Units Method Reference Comment
Δr88.3 ± 6.7kJ/molCIDTPoutsma, Nash, et al., 1997gas phase
Δr91. ± 13.kJ/molTherHierl, Henchman, et al., 1992gas phase; HO- + MeBr:6.0±2.3 kcal/mol endo. "Better than Ingemann and Nibbering, 19852" 2.0 kcal would not show barrier
Δr102. ± 27.kJ/molTherIngemann and Nibbering, 1985, 2gas phase

References

Poutsma, Nash, et al., 1997
Poutsma, J.C.; Nash, J.J.; Paulino, J.A.; Squires, R.R., Absolute Heats of Formation of Phenylcarbene and Vinylcarbene, J. Am. Chem. Soc., 1997, 119, 20, 4686, https://doi.org/10.1021/ja963918s . [all data]

Hierl, Henchman, et al., 1992
Hierl, P.M.; Henchman, M.J.; Paulson, J.F., Threshold Energies for the Reactions HO- + MeX - MeOH + X- measured by Tandem Mass Spectrometry: Acidities of MeCl and MeBr, Int. J. Mass Spectrom. Ion Proc., 1992, 117, 475, https://doi.org/10.1016/0168-1176(92)80109-E . [all data]

Ingemann and Nibbering, 1985
Ingemann, S.; Nibbering, N.M.M., Gas phase chemistry of alpha-thio carbanions, Can. J. Chem., 1985, 62, 2273. [all data]

Ingemann and Nibbering, 1985, 2
Ingemann, S.; Nibbering, N.M.M., Gas-phase acidity of CH3X [X = P(CH3)2, SCH3, F, Cl, Br, I] compounds, J. Chem. Soc. Perkin Trans. 2, 1985, 837. [all data]