Trisulfide, dipropyl
- Formula: C6H14S3
- Molecular weight: 182.370
- IUPAC Standard InChIKey: GAZXPZNJTZIGBO-UHFFFAOYSA-N
- CAS Registry Number: 6028-61-1
- Chemical structure:

Kovats' RI, non-polar column, isothermal

Column type | Active phase | Temperature (C) | I | Reference | Comment |
---|---|---|---|---|---|
Capillary | OV-101 | 130. | 1309. | Misharina and Golovnya, 1989 | He; Column length: 50. m; Column diameter: 0.32 mm |

Van Den Dool and Kratz RI, non-polar column, temperature ramp

Column type | Active phase | I | Reference | Comment |
---|---|---|---|---|
Capillary | DB-1 | 1313. | Pino, Fuentes, et al., 2001 | He, 60. C @ 4. min, 4. K/min; Column length: 30. m; Column diameter: 0.32 mm; Tend: 250. C |
Capillary | DB-1 | 1294. | Johnson, Urso, et al., 1997 | 30. m/0.2 mm/0.25 μm, 50. C @ 2. min, 5. K/min, 300. C @ 5. min |
Capillary | Ultra-1 | 1292.9 | Farkas, Hradský, et al., 1992 | 25. m/0.2 mm/0.33 μm, H2, 2. K/min; Tstart: 60. C; Tend: 230. C |
Capillary | HP-1 | 1314. | Kuo and Ho, 1992 | 50. m/0.32 mm/1.05 μm, He, 2. K/min; Tstart: 40. C; Tend: 260. C |
Capillary | HP-1 | 1313. | Kuo and Ho, 1992, 2 | 50. m/0.32 mm/1.05 μm, He, 2. K/min; Tstart: 40. C; Tend: 260. C |
Capillary | OV-101 | 1302. | Misharina and Golovnya, 1989 | He, 4. K/min; Column length: 50. m; Column diameter: 0.32 mm; Tstart: 50. C; Tend: 250. C |
Capillary | OV-1 | 1314. | Schreyen, Dirinck, et al., 1976 | 1. K/min; Column length: 183. m; Column diameter: 0.762 mm; Tstart: 0. C; Tend: 230. C |

Van Den Dool and Kratz RI, non-polar column, custom temperature program

Column type | Active phase | I | Reference | Comment |
---|---|---|---|---|
Capillary | HP-5MS | 1337.3 | Andriamaharavo, 2014 | 30. m/0.25 mm/0.25 μm, He; Program: 60C (1 min) => 5 C/min => 210C => 10 C/min => 280C (15 min) |
Capillary | SPB-1 | 1312. | Mochizuki, Yamamoto, et al., 1998 | 30. m/0.32 mm/4.0 μm, N2; Program: 40 0C (10 min), 2 0C/min to 180 0C, 25 0C/min to 250 0C (5 min) |

Van Den Dool and Kratz RI, polar column, temperature ramp

Column type | Active phase | I | Reference | Comment |
---|---|---|---|---|
Capillary | HP-Innowax | 1738. | Storsberg, Schulz, et al., 2004 | 60. m/0.25 mm/0.5 μm, H2, 10. K/min; Tstart: 35. C; Tend: 220. C |
Capillary | HP-Innowax | 1713. | Schulz, Krüger, et al., 1998 | 60. m/0.25 mm/0.5 μm, H2, 4. K/min; Tstart: 80. C; Tend: 220. C |

Van Den Dool and Kratz RI, polar column, custom temperature program

Column type | Active phase | I | Reference | Comment |
---|---|---|---|---|
Capillary | Supelcowax-10 | 1683. | Bianchi, Careri, et al., 2007 | 30. m/0.25 mm/0.25 μm, He; Program: 35C(8min) => 4C/min => 60C => 6C/min => 160C => 20C/min => 200C(1min) |

Normal alkane RI, non-polar column, temperature ramp

Column type | Active phase | I | Reference | Comment |
---|---|---|---|---|
Capillary | HP-5 | 1328. | Kubec, Drhová, et al., 1999 | 30. m/0.25 mm/0.25 μm, N2, 40. C @ 3. min, 4. K/min, 240. C @ 10. min |

Normal alkane RI, non-polar column, custom temperature program

Column type | Active phase | I | Reference | Comment |
---|---|---|---|---|
Capillary | HP-5 MS | 1327. | Pyun and Shin, 2006 | 30. m/0.25 mm/0.25 μm; Program: 40 0C (3 min) 2 0C/min -> 150 0C 20 0C/min -> 220 0C (5 min) |
Capillary | SE-30 | 1302. | Vinogradov, 2004 | Program: not specified |

Normal alkane RI, polar column, temperature ramp

Column type | Active phase | I | Reference | Comment |
---|---|---|---|---|
Capillary | Supelcowax-10 | 1721. | Chin, Nazimah, et al., 2007 | 10. m/0.1 mm/0.1 μm, He, 40. C @ 1.5 min, 50. K/min, 240. C @ 2. min |
Capillary | HP-Innowax | 1662. | Kubec, Drhová, et al., 1999 | 30. m/0.25 mm/0.25 μm, He, 40. C @ 3. min, 4. K/min, 190. C @ 10. min |

Normal alkane RI, polar column, custom temperature program

Column type | Active phase | I | Reference | Comment |
---|---|---|---|---|
Capillary | DB-Wax | 1672. | Gyawalia, Seo, et al., 2006 | 60. m/0.2 mm/0.25 μm, He; Program: 40C(3min) => 2C/min => 150C => 4C/min => 220C(20min) => 5C/min => 230C |

Lee's RI, non-polar column, temperature ramp

Column type | Active phase | I | Reference | Comment |
---|---|---|---|---|
Capillary | DB-1 | 228.3 | Johnson, Urso, et al., 1997 | 30. m/0.2 mm/0.25 μm, 50. C @ 2. min, 5. K/min, 300. C @ 5. min |

References

Misharina and Golovnya, 1989
Misharina, T.A.; Golovnya, R.V.,
Regularities of retention of a pseudohomologous series of dialkylpolysulfides in capillary gas chromatography,
Zh. Anal. Khim., 1989, 44, 514-519. [all data]
Pino, Fuentes, et al., 2001
Pino, J.A.; Fuentes, V.; Correa, M.T.,
Volatile constituents of Chinese chive (Allium tuberosum Rottl. ex Sprengel) and Rakkyo (Allium chinense G. Don),
J. Agric. Food Chem., 2001, 49, 3, 1328-1330, https://doi.org/10.1021/jf9907034
. [all data]
Johnson, Urso, et al., 1997
Johnson, C.I.; Urso, A.; Geleta, L.,
Broad spectrum analysis of municipal and industrial effluents discharged into the Peace, Athabasca and Slave river basins: characterization of effluent samples, 1994 - Volume 1 of 2, Northern River Basins Study Project Report No. 121, Norther River Basins Study, Edmonton, Alberta, 1997, 27. [all data]
Farkas, Hradský, et al., 1992
Farkas, P.; Hradský, P.; Kovác, M.,
Novel flavour components identified in the steamn distillate of onion (Allium cepa L.),
Z. Lebensm. Unters. Forsch., 1992, 195, 5, 459-462, https://doi.org/10.1007/BF01191718
. [all data]
Kuo and Ho, 1992
Kuo, M.-C.; Ho, C.-T.,
Volatile constituents of the distilled oils of Welsh onions (Allium fistulosum L. variety Maichuon) and scallions (Allium fistulosum L. variety Caespitosum),
J. Agric. Food Chem., 1992, 40, 1, 111-117, https://doi.org/10.1021/jf00013a021
. [all data]
Kuo and Ho, 1992, 2
Kuo, M.-C.; Ho, C.-T.,
Volatile constituents of the solvent extracts of Welsh onions (Allium fistulosum L. variety Maichuon) and scallions (A. fistulosum L. variety caepitosum),
J. Agric. Food Chem., 1992, 40, 10, 1906-1910, https://doi.org/10.1021/jf00022a036
. [all data]
Schreyen, Dirinck, et al., 1976
Schreyen, L.; Dirinck, P.; van Wassenhove, F.; Schamp, N.,
Analysis of leek volatiles by headspace condensation,
J. Agric. Food Chem., 1976, 24, 6, 1147-1152, https://doi.org/10.1021/jf60208a023
. [all data]
Andriamaharavo, 2014
Andriamaharavo, N.R.,
Retention Data. NIST Mass Spectrometry Data Center., NIST Mass Spectrometry Data Center, 2014. [all data]
Mochizuki, Yamamoto, et al., 1998
Mochizuki, E.; Yamamoto, T.; Komiyama, Y.; Nakazawa, H.,
Identification of allium products using flame photometric detection gas chromatography and distribution patterns of volatile sulfur compounds,
J. Agric. Food Chem., 1998, 46, 12, 5170-5176, https://doi.org/10.1021/jf9803076
. [all data]
Storsberg, Schulz, et al., 2004
Storsberg, J.; Schulz, H.; Keusgen, M.; Tannous, F.; Dehmer, K.J.; Joachim Keller, E.R.,
Chemical characterization of interspecific hybrids between Allium cepa L. and Allium kermesinum Rchb.,
J. Agric. Food Chem., 2004, 52, 17, 5499-5505, https://doi.org/10.1021/jf049684a
. [all data]
Schulz, Krüger, et al., 1998
Schulz, H.; Krüger, H.; Liebmann, J.; Peterka, H.,
Distribution of volatile sulfur compounds in an interspecific hybrid between onion (Allium cepa L.) and leek (Allium porrum L.),
J. Agric. Food Chem., 1998, 46, 12, 5220-5224, https://doi.org/10.1021/jf9806208
. [all data]
Bianchi, Careri, et al., 2007
Bianchi, F.; Careri, M.; Mangia, A.; Musci, M.,
Retention indices in the analysis of food aroma volatile compounds in temperature-programmed gas chromatography: Database creation and evaluation of precision and robustness,
J. Sep. Sci., 2007, 39, 4, 563-572, https://doi.org/10.1002/jssc.200600393
. [all data]
Kubec, Drhová, et al., 1999
Kubec, R.; Drhová, V.; Velísek, J.,
Volatile compounds thermally generated from S-propylcysteine and S-propylcysteine sulfoxide - aroma precursors of Allium vegetables,
J. Agric. Food Chem., 1999, 47, 3, 1132-1138, https://doi.org/10.1021/jf980974z
. [all data]
Pyun and Shin, 2006
Pyun, M.-S.; Shin, S.,
Antifungal effects of the volatile oils from Allium plants against Trichophyton species and synergism of the oils with ketoconazole,
Phytomedicine, 2006, 13, 6, 394-400, https://doi.org/10.1016/j.phymed.2005.03.011
. [all data]
Vinogradov, 2004
Vinogradov, B.A.,
Production, composition, properties and application of essential oils, 2004, retrieved from http://viness.narod.ru. [all data]
Chin, Nazimah, et al., 2007
Chin, S.T.; Nazimah, S.A.H.; Quek, S.Y.; Che Man, Y.B.; Rahman, R.A.; Hashim, D.M.,
Analysis of volatile compounds from Malaysian durians (Durio zibethinus) using headspace SPME coupled to fast GC-MS,
J. Food Comp. Anal., 2007, 20, 1, 31-44, https://doi.org/10.1016/j.jfca.2006.04.011
. [all data]
Gyawalia, Seo, et al., 2006
Gyawalia, R.; Seo, H.-Y.; Lee, H.-J.; Song, H.-P.; Kim, D.-H.; Byun, M.-W.; Kim, K.-S.,
Effect of γ-irradiation on volatile compounds of dried Welsh onion (Allium fistulosum L.),
Radiat. Phys. Chem., 2006, 75, 2, 322-328, https://doi.org/10.1016/j.radphyschem.2005.07.001
. [all data]