2,2-Dicyano-3-phenylpropionitrile

Phase change data

Data compiled as indicated in comments:
AC - William E. Acree, Jr., James S. Chickos
ALS - Hussein Y. Afeefy, Joel F. Liebman, and Stephen E. Stein

Quantity Value Units Method Reference Comment
Δsub23.00 ± 0.091kcal/molVRakus, Verevkin, et al., 1994ALS

Enthalpy of vaporization

ΔvapH (kcal/mol) Temperature (K) Method Reference Comment
16.0318. - 388.BRakus, Verevkin, et al., 1994AC

Enthalpy of sublimation

ΔsubH (kcal/mol) Temperature (K) Method Reference Comment
23.0 ± 0.1353.TRakus, Verevkin, et al., 1994Based on data from 318. - 388. K.; AC

Enthalpy of fusion

ΔfusH (kcal/mol) Temperature (K) Reference Comment
7.000411.2Rakus, Verevkin, et al., 1994AC

References

Rakus, Verevkin, et al., 1994
Rakus, K.; Verevkin, S.P.; Beckhaus, H.-D.; Rchardt, C., Thermochemistry and thermal decomposition of alkyl-substituted tricyanomethyl compounds, Chem. Ber., 1994, 127, 2225-2234. [all data]