Lithium chloride fluoride

Gas phase thermochemistry data

Quantity Value Units Method Reference Comment
Δfgas-753.96kJ/molReviewChase, 1998Data last reviewed in December, 1960
Quantity Value Units Method Reference Comment
gas,1 bar268.02J/mol*KReviewChase, 1998Data last reviewed in December, 1960

Gas Phase Heat Capacity (Shomate Equation)

Cp° = A + B*t + C*t2 + D*t3 + E/t2
H° − H°298.15= A*t + B*t2/2 + C*t3/3 + D*t4/4 − E/t + F − H
S° = A*ln(t) + B*t + C*t2/2 + D*t3/3 − E/(2*t2) + G
    Cp = heat capacity (J/mol*K)
    H° = standard enthalpy (kJ/mol)
    S° = standard entropy (J/mol*K)
    t = temperature (K) / 1000.

View plot Requires a JavaScript / HTML 5 canvas capable browser.

View table.

Temperature (K) 298. - 1000.1000. - 6000.
A 54.4219083.48070
B 73.51730-0.222530
C -72.006200.050931
D 25.15200-0.003867
E -0.691802-3.143000
F -775.1900-787.5490
G 311.0450355.9230
H -753.9570-753.9570
ReferenceChase, 1998Chase, 1998
Comment Data last reviewed in December, 1960 Data last reviewed in December, 1960

References

Chase, 1998
Chase, M.W., Jr., NIST-JANAF Themochemical Tables, Fourth Edition, J. Phys. Chem. Ref. Data, Monograph 9, 1998, 1-1951. [all data]