NiCH2

Vibrational and/or electronic energy levels

Data compiled by: Marilyn E. Jacox

State:   X

Vib.
sym.
 No.   Approximate
 type of mode
 cm-1   Med.   Method   References

a1 1 CH2 s-stretch 2917.1 Ar IR Chang, Hauge, et al., 1990
2 CH2 scissors 1328.5 Ar IR Chang, Hauge, et al., 1990
3 NiC stretch 696.2 Ar IR Chang, Hauge, et al., 1990
b1 4 OPLA 791.9 Ar IR Chang, Hauge, et al., 1990
b2 5 CH2 a-stretch 2973.2 Ar IR Chang, Hauge, et al., 1990
6 CH2 rock 586.7 Ar IR Chang, Hauge, et al., 1990

Additional references: Jacox, 1998, page 219

References

Chang, Hauge, et al., 1990
Chang, S.-C.; Hauge, R.H.; Kafafi, Z.H.; Margrave, J.L.; Billups, W.E., Low-temperature reactions of atomic nickel with diazomethane, Inorg. Chem., 1990, 29, 22, 4373, https://doi.org/10.1021/ic00347a009 . [all data]

Jacox, 1998
Jacox, M.E., Vibrational and electronic energy levels of polyatomic transient molecules: supplement A, J. Phys. Chem. Ref. Data, 1998, 27, 2, 115-393, https://doi.org/10.1063/1.556017 . [all data]