1,1'-Biphenyl, 2,2',4,5',6-Pentachloro-

Phase change data

Data compiled by: William E. Acree, Jr., James S. Chickos

Quantity Value Units Method Reference Comment
Δvap91.6 ± 0.5kJ/molCGCPuri, Chickos, et al., 2001

References

Puri, Chickos, et al., 2001
Puri, Swati; Chickos, James S.; Welsh, William J., Determination of Vaporization Enthalpies of Polychlorinated Biphenyls by Correlation Gas Chromatography, Anal. Chem., 2001, 73, 7, 1480-1484, https://doi.org/10.1021/ac001246p . [all data]