1-Myristic-2-palmitic-3-stearic glycerol

Phase change data

Data compiled by: William E. Acree, Jr., James S. Chickos

Enthalpy of vaporization

ΔvapH (kJ/mol) Temperature (K) Method Reference Comment
157.9523.A,TStephenson and Malanowski, 1987Based on data from 508. - 572. K. See also Perry, Weber, et al., 1949.

References

Stephenson and Malanowski, 1987
Stephenson, Richard M.; Malanowski, Stanislaw, Handbook of the Thermodynamics of Organic Compounds, 1987, https://doi.org/10.1007/978-94-009-3173-2 . [all data]

Perry, Weber, et al., 1949
Perry, E.S.; Weber, W.H.; Daubert, B.F., Vapor Pressures of Phlegmatic Liquids. I. Simple and Mixed Triglycerides, J. Am. Chem. Soc., 1949, 71, 11, 3720-3726, https://doi.org/10.1021/ja01179a038 . [all data]