Polyvinylenediphenylgermane

Condensed phase thermochemistry data

Data compiled by: Eugene S. Domalski and Elizabeth D. Hearing

Quantity Value Units Method Reference Comment
liquid77.25cal/mol*KN/ALebedev, Milov, et al., 1975
Quantity Value Units Method Reference Comment
solid,1 bar77.25cal/mol*KN/ALebedev, Rabinovich, et al., 1978glass phase; Highly elastic state.

Constant pressure heat capacity of liquid

Cp,liquid (cal/mol*K) Temperature (K) Reference Comment
80.00298.15Lebedev, Milov, et al., 1975T = 8 to 324 K.

Constant pressure heat capacity of solid

Cp,solid (cal/mol*K) Temperature (K) Reference Comment
80.00298.15Lebedev, Rabinovich, et al., 1978glass phase; T = 7 to 330 K.

References

Lebedev, Milov, et al., 1975
Lebedev, B.V.; Milov, V.I.; Lityagov, V.Ya.; Sladkov, A.M.; Luneva, L.K., Heat capacity and thermodynamic funcions of poly(vinylenediphenylgermane), Tr. Khim. Khim. Tekhnol., 1975, (4), 46-50. [all data]

Lebedev, Rabinovich, et al., 1978
Lebedev, B.V.; Rabinovich, I.B.; Lebedev, N.K.; Sladkov, A.M.; Vasneva, N.A., The thermodynamic properties of silicon and germanium diphenyldihydride polyaddition products with the bis-ethinyl derivatives of the same metals, Vysokomol. Soedin., 1978, A20, 338-341. [all data]