n-Pentadecylcyclohexane

Gas phase thermochemistry data

Data compiled by: Hussein Y. Afeefy, Joel F. Liebman, and Stephen E. Stein

Quantity Value Units Method Reference Comment
Δfgas-105.14 ± 0.83kcal/molCcbProsen, Johnson, et al., 1946

Condensed phase thermochemistry data

Data compiled by: Hussein Y. Afeefy, Joel F. Liebman, and Stephen E. Stein

Quantity Value Units Method Reference Comment
Δcliquid-3304.61 ± 0.77kcal/molCcbProsen, Johnson, et al., 1946Corresponding Δfliquid = -105.08 kcal/mol (simple calculation by NIST; no Washburn corrections)

Phase change data

Data compiled by: William E. Acree, Jr., James S. Chickos

Quantity Value Units Method Reference Comment
Δvap24.95kcal/molN/AReid, 1972

Enthalpy of vaporization

ΔvapH (kcal/mol) Temperature (K) Reference Comment
18.5511.Dykyj, Svoboda, et al., 1999Based on data from 496. - 677. K.

Enthalpy of fusion

ΔfusH (kcal/mol) Temperature (K) Method Reference
14.0298.2DSCYoung and Schall, 2001
13.9301.N/AMiyajima, Enomoto, et al., 1991

References

Prosen, Johnson, et al., 1946
Prosen, E.J.; Johnson, W.H.; Rossini, F.D., Heats of formation and combustion of the normal alkylcyclopentanes and cyclohexanes and the increment per CH2 group for several homologous series of hydrocarbons, J. Res. NBS, 1946, 37, 51-56. [all data]

Reid, 1972
Reid, Robert C., Handbook on vapor pressure and heats of vaporization of hydrocarbons and related compounds, R. C. Wilhort and B. J. Zwolinski, Texas A Research Foundation. College Station, Texas(1971). 329 pages.$10.00, AIChE J., 1972, 18, 6, 1278-1278, https://doi.org/10.1002/aic.690180637 . [all data]

Dykyj, Svoboda, et al., 1999
Dykyj, J.; Svoboda, J.; Wilhoit, R.C.; Frenkel, M.L.; Hall, K.R., Vapor Pressure of Chemicals: Part A. Vapor Pressure and Antoine Constants for Hydrocarbons and Sulfur, Selenium, Tellurium and Hydrogen Containing Organic Compounds, Springer, Berlin, 1999, 373. [all data]

Young and Schall, 2001
Young, P.H.; Schall, C.A., Cycloalkane solubility determination through differential scanning calorimetry, Thermochimica Acta, 2001, 367-368, 387-392, https://doi.org/10.1016/S0040-6031(00)00658-4 . [all data]

Miyajima, Enomoto, et al., 1991
Miyajima, Seiichi; Enomoto, Takehiko; Kusanagi, Tomohiro; Chiba, Takehiko, Terminal Polar Substituent Effect on the Liquid Crystalline Properties of a Series of 4-Octyloxy-N-(4-substituted benzylidene)anilines., Bull. Chem. Soc. Jpn., 1991, 64, 5, 1679-1681, https://doi.org/10.1246/bcsj.64.1679 . [all data]