Z-13-Octadecen-1-yl acetate

Phase change data

Data compiled by: William E. Acree, Jr., James S. Chickos

Quantity Value Units Method Reference Comment
Δvap108.7kJ/molGCKoutek, Hoskovec, et al., 1997Based on data from 393. - 438. K. See also Ova, Koultek, et al., 2000.

Normal alkane RI, non-polar column, temperature ramp

View large format table.

Column type Active phase I Reference Comment
CapillaryEC-52200.Reboucas, Sant-Ana, et al., 200730. m/0.25 mm/0.25 μm, He, 100. C @ 1. min, 10. K/min; Tend: 250. C

Normal alkane RI, polar column, temperature ramp

View large format table.

Column type Active phase I Reference Comment
CapillaryAT-Wax2054.Reboucas, Sant-Ana, et al., 200730. m/0.25 mm/0.25 μm, He, 100. C @ 1. min, 10. K/min; Tend: 250. C

References

Koutek, Hoskovec, et al., 1997
Koutek, Bohumír; Hoskovec, Michal; Vrkocová, Pavlína; Feltl, Ladislav, Gas chromatographic determination of vapour pressures of pheromone-like compounds IV. Acetates, a reinvestigation, Journal of Chromatography A, 1997, 759, 1-2, 93-109, https://doi.org/10.1016/S0021-9673(96)00775-3 . [all data]

Ova, Koultek, et al., 2000
Ova, P.V.; Koultek, B.; Hoskovec, M., Practice Oriented Results on Use and Production of Neem Ingredients and Pheromones VI, H. Kleeberg and C.P.W. Zebitz, ed(s)., Druck and Graphic, Giessen, 2000, 211-218. [all data]