2',3',5'-Tri-o-methyladenosine

Gas phase ion energetics data

Data compiled by: Sharon G. Lias, Rhoda D. Levin, and Sherif A. Kafafi

Ionization energy determinations

IE (eV) Method Reference Comment
8.1PEYu, O'Donnell, et al., 1981
8.35PEYu, O'Donnell, et al., 1981Vertical value

References

Yu, O'Donnell, et al., 1981
Yu, C.; O'Donnell, T.J.; LeBreton, P.R., Ultraviolet photoelectron studies of volatile nucleoside models. Vertical ionization potential measurements of methylated uridine, thymidine, cytidine, and adenosine, J. Phys. Chem., 1981, 85, 3851. [all data]