Pentane, 2,3-dichloro-

Phase change data

Data compiled by: Thermodynamics Research Center, NIST Boulder Laboratories, Chris Muzny director

Quantity Value Units Method Reference Comment
Tboil413.15KN/ATishchenko and Zhokhovits, 1948Uncertainty assigned by TRC = 2. K
Tboil418.15KN/ATishchenko and Zhokhovits, 1948Uncertainty assigned by TRC = 4. K
Tboil414.KN/ATishchenko and Shchigel'skaya, 1937Uncertainty assigned by TRC = 2. K
Tboil417.KN/ATishchenko and Shchigel'skaya, 1937Uncertainty assigned by TRC = 2. K
Tboil411.15KN/AAyres, 1929Uncertainty assigned by TRC = 1.5 K

In addition to the Thermodynamics Research Center (TRC) data available from this site, much more physical and chemical property data is available from the following TRC products:

Normal alkane RI, non-polar column, isothermal

View large format table.

Column type Active phase Temperature (C) I Reference Comment
CapillaryApiezon L130.844.Arruda, Junkes, et al., 2008

References

Tishchenko and Zhokhovits, 1948
Tishchenko, D.V.; Zhokhovits, N., Chloro Derivatives II. Inductive Effect and Order of Substitution of Hydrogen Atoms eith Chlorine in Chloroalkanes, Zh. Obshch. Khim., 1948, 18, 43. [all data]

Tishchenko and Shchigel'skaya, 1937
Tishchenko, D.V.; Shchigel'skaya, M.A., Zh. Obshch. Khim., 1937, 7, 1246. [all data]

Ayres, 1929
Ayres, E.E., Ind. Eng. Chem., 1929, 21, 899. [all data]

Arruda, Junkes, et al., 2008
Arruda, A.C.S.; Junkes, B. da.S.; Souza, E.S.; Yunes, R.A.; Heizen, V.E.F., Semi-Emlirical Topological Index to Predict Properties of Halogenated Aliphatic Compounds, J. Chemometrics, 2008, 22, 3-4, 186-194, https://doi.org/10.1002/cem.1121 . [all data]