2-Furanmethanol, 5-ethenyltetrahydro-α,α,5-trimethyl-, cis-

Van Den Dool and Kratz RI, non-polar column, temperature ramp

Data compiled by: NIST Mass Spectrometry Data Center, William E. Wallace, director

Column type CapillaryCapillaryCapillaryCapillaryCapillary
Active phase CP-Sil PONA GBDB-5HP-5SPB-1HP-5MS
Column length (m) 100.30.30.30.30.
Carrier gas HeHeHeHeHe
Substrate
Column diameter (mm) 0.250.250.250.250.25
Phase thickness (μm) 0.250.250.250.250.25
Tstart (C) 140.60.50.50.60.
Tend (C) 230.246.250.250.280.
Heat rate (K/min) 5.3.4.5.4.
Initial hold (min) 10. 4.3.5.
Final hold (min) 25. 10.15.
I 1064.1077.1073.1089.1074.
ReferenceCunicao, Lopes, et al., 2007Hongratanaworakit and Buchbauer, 2007Quijano, Salamanca, et al., 2007Radulovic, Lazarevic, et al., 2007Radulovic, Lazarevic, et al., 2007
Comment MSDC-RI MSDC-RI MSDC-RI MSDC-RI MSDC-RI
Column type CapillaryCapillaryCapillaryCapillaryCapillary
Active phase HP-5MSDB-5HP-5MSDB-5CP Sil 5 CB
Column length (m) 30.30.30.30.30.
Carrier gas HeHeHeHeN2
Substrate
Column diameter (mm) 0.250.250.250.320.25
Phase thickness (μm) 0.250.250.250.250.25
Tstart (C) 60.60.60.40.50.
Tend (C) 280.240.280.250.200.
Heat rate (K/min) 4.3.3.5.5.
Initial hold (min) 5.  2.
Final hold (min)    5.
I 1080.1074.1088.1068.1087.
ReferenceSaroglou, Arfan, et al., 2007Telascrea, de Araujo, et al., 2007Vagionas, Ngassapa, et al., 2007Wu, Zorn, et al., 2007Andrianoelisoa H.S., Menut C., et al., 2006
Comment MSDC-RI MSDC-RI MSDC-RI MSDC-RI MSDC-RI
Column type CapillaryCapillaryCapillaryCapillaryCapillary
Active phase DB-5SPB-1DB-5BP-1DB-1
Column length (m) 30.30.30.50.30.
Carrier gas  HeHeHeN2
Substrate
Column diameter (mm) 0.250.250.20.250.25
Phase thickness (μm) 0.250.250.250.250.25
Tstart (C) 60.50.50.60.50.
Tend (C) 220.250.250.220.220.
Heat rate (K/min) 3.5.5.2.4.
Initial hold (min)  3.3.
Final hold (min)  15.15.20.
I 1070.1089.1070.1056.1068.
ReferenceBastos, Ishimoto, et al., 2006Blagojevic, Radulovic, et al., 2006Blagojevic, Radulovic, et al., 2006Bousmaha, Boti, et al., 2006Kuiate, Bessière, et al., 2006
Comment MSDC-RI MSDC-RI MSDC-RI MSDC-RI MSDC-RI
Column type CapillaryCapillaryCapillaryCapillaryCapillary
Active phase HP-1DB-1SPB-1HP-5MSDB-5
Column length (m) 25.25.30.30.30.
Carrier gas He HeHeHe
Substrate
Column diameter (mm) 0.20.20.20.250.25
Phase thickness (μm) 0.330.330.20.250.25
Tstart (C) 60.50.70.60.50.
Tend (C) 300.300.220.280.250.
Heat rate (K/min) 5.4.3.4.5.
Initial hold (min) 3.  5.2.
Final hold (min) 30. 15.
I 1056.1087.1056.1071.1087.
ReferenceNath, Baruah, et al., 2006Osorio, Alarcon, et al., 2006Salgueiro L.R., Pinto E., et al., 2006Saroglou, Dorizas, et al., 2006Su, Ho, et al., 2006
Comment MSDC-RI MSDC-RI MSDC-RI MSDC-RI MSDC-RI
Column type CapillaryCapillaryCapillaryCapillaryCapillary
Active phase CP Sil 5 CBDB-1DB-5DB-1DB-1
Column length (m) 25.30.30.30.25.
Carrier gas H2N2H2
Substrate
Column diameter (mm) 0.250.250.250.320.25
Phase thickness (μm)  0.250.250.250.25
Tstart (C) 80.50.35.50.60.
Tend (C) 270.200.270.250.180.
Heat rate (K/min) 10.5.5.2.3.
Initial hold (min)    8.10.
Final hold (min)   20. 10.
I 1072.1078.1074.1059.1075.
ReferenceZiegenbein, Hanssen, et al., 2006Agnaniet, Makani, et al., 2005Alves, Pinto, et al., 2005Dob, Dahmane, et al., 2005bin Jantan, Yalvema, et al., 2005
Comment MSDC-RI MSDC-RI MSDC-RI MSDC-RI MSDC-RI
Column type CapillaryCapillaryCapillaryCapillaryCapillary
Active phase DB-5HP-5MSSPB-1ZB-5SPB-1
Column length (m) 25.30.30.30.30.
Carrier gas N2HeHeHeliumHe
Substrate
Column diameter (mm) 0.250.250.250.320.2
Phase thickness (μm) 0.250.250.250.500.2
Tstart (C) 75.60.70.40.70.
Tend (C) 210.250.220.265.220.
Heat rate (K/min) 3.4.3.7.3.
Initial hold (min) 10.2.
Final hold (min) 1.20.15.5.15.
I 1085.1074.1056.1087.1055.
Referencebin Jantan, Yalvema, et al., 2005, 2Pino, Mesa, et al., 2005Antunes, Sevinate-Pinto, et al., 2004Bell, 2004Cavaleiro, Salgueiro, et al., 2004
Comment MSDC-RI MSDC-RI MSDC-RI MSDC-RI MSDC-RI
Column type CapillaryCapillaryCapillaryCapillaryCapillary
Active phase HP-1DB-5DB-5SPB-1RSL-200
Column length (m) 25.30.30.30.30.
Carrier gas HeN2N2HeH2
Substrate
Column diameter (mm) 0.320.250.250.20.32
Phase thickness (μm) 0.170.250.250.20.25
Tstart (C) 50.60.60.70.40.
Tend (C) 200.240.240.220.280.
Heat rate (K/min) 3.3.3.3.6.
Initial hold (min)     5.
Final hold (min)    15.5.
I 1047.1076.1076.1055.1097.
ReferenceFernández-Ocaña, Gómez-Rodríguez, et al., 2004Flamini, Cioni, et al., 2004Flamini, Cioni, et al., 2004Moldão-Martins, Beirão-da-Costa, et al., 2004Ngassoum, Ousmaila, et al., 2004
Comment MSDC-RI MSDC-RI MSDC-RI MSDC-RI MSDC-RI
Column type CapillaryCapillaryCapillaryCapillaryCapillary
Active phase SPB-5HP-5MSBP-1DB-5OV-1
Column length (m) 30.30.50.25.25.
Carrier gas HeHeHeN2H2
Substrate
Column diameter (mm) 0.250.250.220.250.25
Phase thickness (μm) 0.250.250.250.250.3
Tstart (C) 60.50.60.75.50.
Tend (C) 250.250.220.210.200.
Heat rate (K/min) 4.3.2.3.3.
Initial hold (min) 2.  10.1.
Final hold (min) 20. 20.1.20.
I 1074.1073.1057.1075.1060.
ReferencePino, Marbot, et al., 2004Salido, Valenzuela, et al., 2004Tam, Thuam, et al., 2004bin Ahmad and bin Jantan, 2003Bicchi, Rubiolo, et al., 2003
Comment MSDC-RI MSDC-RI MSDC-RI MSDC-RI MSDC-RI
Column type CapillaryCapillaryCapillaryCapillaryCapillary
Active phase Ultra-2SPB-1DB-5DB-5DB-5
Column length (m) 25.30.30.30.30.
Carrier gas H2HeN2HeN2
Substrate
Column diameter (mm) 0.250.250.250.250.25
Phase thickness (μm) 0.330.250.250.250.25
Tstart (C) 40.35.70.75.75.
Tend (C) 280.225.230.230.230.
Heat rate (K/min) 3.4.2.3.3.
Initial hold (min) 2.5.2.10.10.
Final hold (min) 10.20.20.20.
I 1070.1069.1070.1075.1075.
ReferenceCeva-Antunes, Bizzo, et al., 2003Chisholm, Jell, et al., 2003Choi, 2003Jantan, Ling, et al., 2003bin Jantan, Yassin, et al., 2003
Comment MSDC-RI MSDC-RI MSDC-RI MSDC-RI MSDC-RI
Column type CapillaryCapillaryCapillaryCapillaryCapillary
Active phase HP-5HP-5MSHP-5CP Sil 5 CBSPB-5
Column length (m) 30.60.30.60.30.
Carrier gas HeHeHeHeHe
Substrate
Column diameter (mm) 0.250.250.250.320.25
Phase thickness (μm) 0.250.250.250.250.25
Tstart (C) 60.40.60.60.60.
Tend (C) 280.310.240.280.250.
Heat rate (K/min) 4.3.3.3.4.
Initial hold (min) 5.1. 10.2.
Final hold (min)  20. 60.20.
I 1074.1075.1076.1070.1074.
ReferenceKarioti, Skaltsa, et al., 2003Lalel, Singh, et al., 2003Macchioni, Cioni, et al., 2003Pino, Almora, et al., 2003Pino, Marbot, et al., 2003
Comment MSDC-RI MSDC-RI MSDC-RI MSDC-RI MSDC-RI
Column type CapillaryCapillaryCapillaryCapillaryCapillary
Active phase HP-5Mega 5MSHP-5DB-5BP-1
Column length (m) 30.30.30.30.50.
Carrier gas HeHeN2HeHe
Substrate
Column diameter (mm) 0.250.250.250.250.22
Phase thickness (μm) 0.250.250.250.250.25
Tstart (C) 40.40.60.60.60.
Tend (C) 240.240.220.260.220.
Heat rate (K/min) 3.3.5.4.2.
Initial hold (min)  2.10.
Final hold (min)     20.
I 1070.1075.1075.1088.1058.
ReferenceShellie and Marriott, 2003Verzera, Trozzi, et al., 2003Flamini, Cioni, et al., 2002Javidnia, Miri, et al., 2002Lota, de Rocca Serra, et al., 2002
Comment MSDC-RI MSDC-RI MSDC-RI MSDC-RI MSDC-RI
Column type CapillaryCapillaryCapillaryCapillaryCapillary
Active phase RTX-5CP Sil 5 CBCP Sil 5 CBHP-5RTX-5
Column length (m) 30.30.50.30.30.
Carrier gas HeH2HeHeHe
Substrate
Column diameter (mm) 0.250.250.320.250.25
Phase thickness (μm) 0.250.250.40.250.25
Tstart (C) 45.60.60.60.45.
Tend (C) 300.280.280.280.250.
Heat rate (K/min) 3.2.3.3.3.
Initial hold (min) 6.10.10. 6.
Final hold (min) 10.40.60.
I 1072.1068.1068.1047.1074.
ReferenceMondello, Zappia, et al., 2002Pino, Marbot, et al., 2002Pino, Marbot, et al., 2002, 2Pitarokili, Couladis, et al., 2002Shellie, Mondello, et al., 2002
Comment MSDC-RI MSDC-RI MSDC-RI MSDC-RI MSDC-RI
Column type CapillaryCapillaryCapillaryCapillaryCapillary
Active phase RTX-5SPB-1HP-5HP-5MSSE-30
Column length (m) 30.15.30.30.25.
Carrier gas He HeHeN2
Substrate
Column diameter (mm) 0.250.250.250.250.20
Phase thickness (μm) 0.250.250.250.25
Tstart (C) 45.35.60.60.60.
Tend (C) 250.225.380.280.180.
Heat rate (K/min) 3.6.3.3.3.
Initial hold (min) 6.3. 5.10.
Final hold (min)  10.  1.
I 1079.1058.1066.1074.1075.
ReferenceShellie, Mondello, et al., 2002Chisholm, Wilson, et al., 2001Couladis, Tsortanidou, et al., 2001Giamakis, Kretsi, et al., 2001bin Jantan, Basni, et al., 2001
Comment MSDC-RI MSDC-RI MSDC-RI MSDC-RI MSDC-RI
Column type CapillaryCapillaryCapillaryCapillaryCapillary
Active phase BP-1BP-1CP Sil 5 CBCP Sil 5 CBHP-5MS
Column length (m) 50.50.50.50.30.
Carrier gas HeHeHeHeHe
Substrate
Column diameter (mm) 0.220.220.320.320.25
Phase thickness (μm) 0.250.250.40.40.25
Tstart (C) 60.60.60.60.50.
Tend (C) 220.220.280.280.250.
Heat rate (K/min) 2.2.3.3.3.
Initial hold (min)   10.10.
Final hold (min)   60.60.
I 1058.1058.1068.1068.1073.
ReferenceLota, Serra, et al., 2001Lota, Serra, et al., 2001Pino and Marbot, 2001Pino, Marbot, et al., 2001Salido, Altarejos, et al., 2001
Comment MSDC-RI MSDC-RI MSDC-RI MSDC-RI MSDC-RI
Column type CapillaryCapillaryCapillaryCapillaryCapillary
Active phase HP-5DB-1HP-5CP Sil 8 CBCP Sil 8 CB
Column length (m) 30.30.30.25.25.
Carrier gas HeH2He
Substrate
Column diameter (mm) 0.200.320.250.20.2
Phase thickness (μm) 0.250.250.250.250.25
Tstart (C) 60.40.70.40.40.
Tend (C) 180.245.230.200.200.
Heat rate (K/min) 4.3.2.2.2.
Initial hold (min) 8.3. 8.8.
Final hold (min) 2.20.
I 1074.1068.1073.1057.1056.
ReferenceAlonzo, Bosco, et al., 2000Brat, Brillouet, et al., 2000Song, Sawamura, et al., 2000Yassaa, Meklati, et al., 2000Yassaa, Meklati, et al., 2000
Comment MSDC-RI MSDC-RI MSDC-RI MSDC-RI MSDC-RI
Column type CapillaryCapillaryCapillaryCapillaryCapillary
Active phase SPB-1BP-1DB-5Methyl SiliconeHP-101
Column length (m) 60.50.30.25.50.
Carrier gas N2HeH2HeN2
Substrate
Column diameter (mm) 0.320.220.250.20.25
Phase thickness (μm) 0.250.25 0.3
Tstart (C) 40.60.60.40.70.
Tend (C) 200.220.220.200.200.
Heat rate (K/min) 4.2.2.2.3.
Initial hold (min)   3.
Final hold (min) 20.20.
I 1069.1062.1068.1067.1071.
ReferenceChen, Huang, et al., 1998Tam, An, et al., 1998Sakho, Chassagne, et al., 1997Píry, Príbela, et al., 1995Chung, Eiserich, et al., 1993
Comment MSDC-RI MSDC-RI MSDC-RI MSDC-RI MSDC-RI
Column type CapillaryCapillary
Active phase OV-101OV-101
Column length (m) 50.50.
Carrier gas N2N2
Substrate
Column diameter (mm) 0.250.25
Phase thickness (μm)
Tstart (C) 80.80.
Tend (C) 200.200.
Heat rate (K/min) 2.2.
Initial hold (min)
Final hold (min)
I 1063.1068.
ReferenceYang, Sugisawa, et al., 1992Yang, Sugisawa, et al., 1992
Comment MSDC-RI MSDC-RI

Normal alkane RI, polar column, temperature ramp

Data compiled by: NIST Mass Spectrometry Data Center, William E. Wallace, director

Column type CapillaryCapillaryCapillaryCapillaryCapillary
Active phase HP-InnowaxDB-WaxHP-InnowaxCarbowaxTC-FFAP
Column length (m) 30.30.50.60.
Carrier gas NitrogenHeliumHeliumHeHe
Substrate
Column diameter (mm) 0.250.250.200.20.25
Phase thickness (μm) 0.520.250.200.250.25
Tstart (C) 35.40.45.60.60.
Tend (C) 205.230.190.250.220.
Heat rate (K/min) 3.3.4.2.3.
Initial hold (min) 10.2.2.8.
Final hold (min) 10.5.50.15.30.
I 1450.1438.1448.1423.1480.
ReferenceWannes, Mhamdi, et al., 2009Zhao, Xu, et al., 2009Soria, Sanz, et al., 2008Ferhat, Tigrine-Kordjani, et al., 2007Kurose, Okamura, et al., 2007
Comment MSDC-RI MSDC-RI MSDC-RI MSDC-RI MSDC-RI
Column type CapillaryCapillaryCapillaryCapillaryCapillary
Active phase Supelcowax-10Supelcowax-10DB-WaxAT-WaxDB-Wax
Column length (m) 30.30.30.60.60.
Carrier gas HeHeHeHeHe
Substrate
Column diameter (mm) 0.20.250.250.250.25
Phase thickness (μm) 0.20.250.250.250.5
Tstart (C) 70.40.40.60.50.
Tend (C) 220.250.230.200.230.
Heat rate (K/min) 3.3.4.4.3.
Initial hold (min)  5.2. 2.
Final hold (min) 15.10.5.20.20.
I 1442.1460.1426.1425.1438.
ReferencePinto, Salgueiro, et al., 2007Vichi, Riu-Aumatell, et al., 2007Xu, Fan, et al., 2007Borges, Rojas, et al., 2006Cai, Lin, et al., 2006
Comment MSDC-RI MSDC-RI MSDC-RI MSDC-RI MSDC-RI
Column type CapillaryCapillaryCapillaryCapillaryCapillary
Active phase DB-Wax EtrDB-WaxHP-WaxHP-20MHP-20M
Column length (m) 60.60.30.30.50.
Carrier gas He NitrogenN2He
Substrate
Column diameter (mm) 0.250.250.250.250.2
Phase thickness (μm) 0.250.250.250.250.2
Tstart (C) 40.70.50.50.70.
Tend (C) 230.230.280.250.180.
Heat rate (K/min) 2.2.5.5.4.
Initial hold (min) 5.2.  4.
Final hold (min) 100.20.5.10.15.
I 1447.1445.1477.1477.1405.
ReferenceIbarz, Ferreira, et al., 2006Lan Phi N.T., Nishiyama C., et al., 2006Marzouk, Mansour, et al., 2006Marzouk, Neffati, et al., 2006Mastelic, Jerkovic, et al., 2006
Comment MSDC-RI MSDC-RI MSDC-RI MSDC-RI MSDC-RI
Column type CapillaryCapillaryCapillaryCapillaryCapillary
Active phase NB-20MDB-WaxCarbowax-PEGSupelcowax-10Carbowax 20M
Column length (m) 30.60.60.30.60.
Carrier gas He HeliumHeN2
Substrate
Column diameter (mm) 0.20.250.200.250.25
Phase thickness (μm) 0.250.250.250.250.25
Tstart (C) 50.70.60.50.40.
Tend (C) 250.230.250.220.190.
Heat rate (K/min) 2.2.2.4.10.
Initial hold (min)  2.8.1.2.
Final hold (min)  20.15.10.15.
I 1425.1448.1423.1465.1423.
ReferenceOrav, Raal, et al., 2006Sawamura, Onishi, et al., 2006Tigrine-Kordiani, Meklati, et al., 2006Wong, Lim, et al., 2006Babu and Kaul, 2005
Comment MSDC-RI MSDC-RI MSDC-RI MSDC-RI MSDC-RI
Column type CapillaryCapillaryCapillaryCapillaryCapillary
Active phase Carbowax 20MSupelcowaxStabilwaxInnowaxDB-Wax
Column length (m) 50.60.30.60.30.
Carrier gas HeliumHe HeHe
Substrate
Column diameter (mm) 0.250.20.320.250.25
Phase thickness (μm) 0.250.20.50.250.25
Tstart (C) 40.60.40.60.50.
Tend (C) 190.230.280.240.180.
Heat rate (K/min) 4.4.6.5.3.
Initial hold (min) 2.30.5.
Final hold (min) 30. 5.30.40.
I 1436.1410.1422.1441.1438.
Referencede la Fuente, Martinez-Castro, et al., 2005Gauvin and Smadja, 2005Jirovetz, Buchbauer, et al., 2005Joichi, Yomogida, et al., 2005Lee, Umano, et al., 2005
Comment MSDC-RI MSDC-RI MSDC-RI MSDC-RI MSDC-RI
Column type CapillaryCapillaryCapillaryCapillaryCapillary
Active phase DB-WaxDB-WaxDB-WaxDB-WaxDB-Wax
Column length (m) 30.60.60.60.60.
Carrier gas HeN2N2N2N2
Substrate
Column diameter (mm) 0.250.250.250.250.25
Phase thickness (μm) 0.250.250.250.250.25
Tstart (C) 50.70.70.70.70.
Tend (C) 180.230.230.230.230.
Heat rate (K/min) 3.2.2.2.2.
Initial hold (min)  2.2.2.2.
Final hold (min) 40.20.20.20.20.
I 1439.1423.1447.1451.1423.
ReferenceLee, Umano, et al., 2005Njoroge, Koaze, et al., 2005Njoroge, Koaze, et al., 2005, 2Choi, 2004Choi, 2004, 2
Comment MSDC-RI MSDC-RI MSDC-RI MSDC-RI MSDC-RI
Column type CapillaryCapillaryCapillaryCapillaryCapillary
Active phase NB-20MSW-10DB-WaxDB-WaxHP-Innowax
Column length (m) 50.50.60.60.50.
Carrier gas HeHe NitrogenHe
Substrate
Column diameter (mm) 0.20.200.250.250.2
Phase thickness (μm) 0.250.250.250.250.2
Tstart (C) 50.50.70.70.45.
Tend (C) 250.230.230.230.190.
Heat rate (K/min) 2.2.2.2.4.
Initial hold (min)   2.2.2.
Final hold (min)   20. 50.
I 1423.1420.1464.1464.1451.
ReferenceRaal, Arak, et al., 2004Raal, Paaver, et al., 2004Sawamura, Son, et al., 2004Sawamura, Sou, et al., 2004Soria, Gonzalez, et al., 2004
Comment MSDC-RI MSDC-RI MSDC-RI MSDC-RI MSDC-RI
Column type CapillaryCapillaryCapillaryCapillaryCapillary
Active phase DB-WaxHP-InnowaxCarbowax 20MDB-WaxDB-Wax
Column length (m) 60.50.50.60.60.
Carrier gas HeliumHeHeN2
Substrate
Column diameter (mm) 0.250.20.250.250.25
Phase thickness (μm)  0.20.250.25
Tstart (C) 70.45.45.70.60.
Tend (C) 210.190.190.230.180.
Heat rate (K/min) 2.4.4.2.3.
Initial hold (min)  2.2.2.4.
Final hold (min) 60.50.50.20.
I 1446.1448.1448.1399.1483.
ReferenceMookdasanit, Tamura, et al., 2003Soria, Martinez-Castro, et al., 2003Soria, Martinez-Castro, et al., 2003Tu, Onishi, et al., 2003Ito, Sugimoto, et al., 2002
Comment MSDC-RI MSDC-RI MSDC-RI MSDC-RI MSDC-RI
Column type CapillaryCapillaryCapillaryCapillaryCapillary
Active phase DB-WaxDB-WaxDB-WaxCarbowax 20MDB-Wax
Column length (m) 60.60.30.50.60.
Carrier gas N2HeHeHe
Substrate
Column diameter (mm) 0.250.250.250.220.25
Phase thickness (μm) 0.25 0.10.250.25
Tstart (C) 70.60.40.60.30.
Tend (C) 230.220.180.220.170.
Heat rate (K/min) 2.2.2.2.2.
Initial hold (min)  4.5. 4.
Final hold (min)   20. 30.
I 1453.1494.1466.1422.1470.
ReferenceTu, Thanh, et al., 2002Jiang, Kojima, et al., 2001Kato and Shibamoto, 2001Vernin, Lageot, et al., 2001Buttery, Light, et al., 2000
Comment MSDC-RI MSDC-RI MSDC-RI MSDC-RI MSDC-RI
Column type CapillaryCapillaryCapillaryCapillaryCapillary
Active phase CP-Wax 52CBDB-WaxDB-WaxDB-WaxTC-Wax
Column length (m) 50.30.30.60.60.
Carrier gas HeHeHeHe
Substrate
Column diameter (mm) 0.300.250.250.250.25
Phase thickness (μm) 0.250.250.250.25
Tstart (C) 40.50.50.40.80.
Tend (C) 220.240.240.200.240.
Heat rate (K/min) 3.4.4.2.3.
Initial hold (min) 5.3.3.2.5.
Final hold (min)  10.10.
I 1415.1426.1432.1444.1443.
ReferenceChagonda, Makanda, et al., 2000Parada, Duque, et al., 2000Parada, Duque, et al., 2000Umano, Nakahara, et al., 1999Shuichi, Masazumi, et al., 1996
Comment MSDC-RI MSDC-RI MSDC-RI MSDC-RI MSDC-RI
Column type CapillaryCapillaryCapillaryCapillaryCapillary
Active phase Supelcowax-10Carbowax 20MCarbowax 20MCarbowax 20MDB-Wax
Column length (m) 60.60.50.50.60.
Carrier gas He HeHeHe
Substrate
Column diameter (mm) 0.250.250.250.250.32
Phase thickness (μm) 0.25   0.25
Tstart (C) 40.60.60.60.30.
Tend (C) 200.180.180.180.180.
Heat rate (K/min) 3.2.2.2.2.
Initial hold (min) 3.4.4.4.4.
Final hold (min) 30.   25.
I 1439.1440.1415.1415.1454.
ReferenceWong and Lai, 1996Kawakami, Ganguly, et al., 1995Kawakami, Kobayashi, et al., 1993Kawakami and Kobayashi, 1991Takeoka, Buttery, et al., 1991
Comment MSDC-RI MSDC-RI MSDC-RI MSDC-RI MSDC-RI
Column type CapillaryCapillaryCapillaryCapillaryCapillary
Active phase Carbowax 20MCarbowax 20MCarbowax 20MCarbowax 20MCarbowax 20M
Column length (m) 50.50.50.50.50.
Carrier gas N2N2N2N2
Substrate
Column diameter (mm) 0.220.220.220.220.32
Phase thickness (μm)
Tstart (C) 80.80.80.80.70.
Tend (C) 200.200.200.200.180.
Heat rate (K/min) 3.3.3.3.2.
Initial hold (min)
Final hold (min)
I 1435.1443.1435.1443.1452.
ReferenceMihara, Tateba, et al., 1988Mihara, Tateba, et al., 1988Mihara, Tateba, et al., 1987Mihara, Tateba, et al., 1987Engel and Tressl, 1983
Comment MSDC-RI MSDC-RI MSDC-RI MSDC-RI MSDC-RI
Column type CapillaryCapillary
Active phase Carbowax 20MCarbowax 20M
Column length (m) 50.50.
Carrier gas N2N2
Substrate
Column diameter (mm) 0.280.28
Phase thickness (μm)
Tstart (C) 80.80.
Tend (C) 170.170.
Heat rate (K/min) 1.1.
Initial hold (min)
Final hold (min)
I 1409.1410.
ReferenceYamaguchi and Shibamoto, 1980Yamaguchi and Shibamoto, 1980
Comment MSDC-RI MSDC-RI

Van Den Dool and Kratz RI, polar column, temperature ramp

Data compiled by: NIST Mass Spectrometry Data Center, William E. Wallace, director

Column type CapillaryCapillaryCapillaryCapillaryCapillary
Active phase DB-WaxZB-WaxBP-20DB-WaxLM-120
Column length (m) 30.30.50.30.50.
Carrier gas HeHeHeHe
Substrate
Column diameter (mm) 0.320.320.250.250.25
Phase thickness (μm) 0.50.250.250.250.5
Tstart (C) 40.40.60.50.50.
Tend (C) 240.250.220.220.240.
Heat rate (K/min) 7.5.2.4.3.
Initial hold (min)  2. 4.
Final hold (min) 5.5.20.20.30.
I 1451.1431.1439.1427.1487.
ReferenceMahattanatawee K., Perez-Cacho P.R., et al., 2007Wu, Zorn, et al., 2007Bousmaha, Boti, et al., 2006Osorio, Alarcon, et al., 2006Pinto, Guedes, et al., 2006
Comment MSDC-RI MSDC-RI MSDC-RI MSDC-RI MSDC-RI
Column type CapillaryCapillaryCapillaryCapillaryCapillary
Active phase Supelcowax-10DB-WaxOV-351DB-WaxSupelcowax-10
Column length (m) 30.30.50.30.30.
Carrier gas HeHeHeHeliumHe
Substrate
Column diameter (mm) 0.20.250.320.320.2
Phase thickness (μm) 0.20.250.20.500.2
Tstart (C) 70.40.60.40.70.
Tend (C) 220.240.220.240.220.
Heat rate (K/min) 3.6.5.7.3.
Initial hold (min)  10.
Final hold (min) 15.25. 5.15.
I 1442.1451.1420.1480.1439.
ReferenceSalgueiro L.R., Pinto E., et al., 2006Varming, Andersen, et al., 2006Bonvehí, 2005Bell, 2004Cavaleiro, Salgueiro, et al., 2004
Comment MSDC-RI MSDC-RI MSDC-RI MSDC-RI MSDC-RI
Column type CapillaryCapillaryCapillaryCapillaryCapillary
Active phase ZB-WaxDB-Wax EtrBP-20DB-WaxDB-Wax
Column length (m) 30.30.50.30.30.
Carrier gas HeHeHeHe
Substrate
Column diameter (mm) 0.250.250.220.250.32
Phase thickness (μm) 0.150.250.250.250.5
Tstart (C) 35.40.60.40.40.
Tend (C) 220.245.220.240.245.
Heat rate (K/min) 1.83.2.6.3.
Initial hold (min) 10.3. 10.3.
Final hold (min) 10.20.20.25.20.
I 1463.1457.1443.1425.1465.
ReferenceLedauphin, Saint-Clair, et al., 2004Ménager, Jost, et al., 2004Tam, Thuam, et al., 2004Varming, Andersen, et al., 2004Aubert, Ambid, et al., 2003
Comment MSDC-RI MSDC-RI MSDC-RI MSDC-RI MSDC-RI
Column type CapillaryCapillaryCapillaryCapillaryCapillary
Active phase Carbowax 20MInnowaxDB-WaxAT-WaxBP-20
Column length (m) 25.15.60.60.50.
Carrier gas HeHeN2HeHe
Substrate
Column diameter (mm) 0.250.250.250.320.22
Phase thickness (μm) 0.30.250.250.250.25
Tstart (C) 50.35.70.65.60.
Tend (C) 200.225.230.250.220.
Heat rate (K/min) 3.4.2.2.2.
Initial hold (min) 1.5.2.10.
Final hold (min) 20.20.20.60.20.
I 1395.1445.1453.1454.1436.
ReferenceBicchi, Rubiolo, et al., 2003Chisholm, Jell, et al., 2003Choi, 2003Pino, Almora, et al., 2003Lota, de Rocca Serra, et al., 2002
Comment MSDC-RI MSDC-RI MSDC-RI MSDC-RI MSDC-RI
Column type CapillaryCapillaryCapillaryCapillaryCapillary
Active phase RTX-WaxSupelcowax-10AT-WaxDB-WaxAT-Wax
Column length (m) 30.30.60.30.60.
Carrier gas HeHeHeH2He
Substrate
Column diameter (mm) 0.250.250.320.320.32
Phase thickness (μm) 0.250.250.250.250.25
Tstart (C) 45.50.65.35.65.
Tend (C) 250.230.250.220.250.
Heat rate (K/min) 3.3.2.4.2.
Initial hold (min) 6. 10.0.510.
Final hold (min) 10.30.60. 60.
I 1423.1474.1449.1471.81424.
ReferenceMondello, Zappia, et al., 2002Moreira, Trugo, et al., 2002Pino, Marbot, et al., 2002Pet'ka, Mocák, et al., 2001Pino and Marbot, 2001
Comment MSDC-RI MSDC-RI MSDC-RI MSDC-RI MSDC-RI
Column type CapillaryCapillaryCapillaryCapillaryCapillary
Active phase AT-WaxDB-WaxDB-WaxDB-WaxDB-Wax
Column length (m) 60.30.30.30.30.
Carrier gas HeHeHeHe
Substrate
Column diameter (mm) 0.320.320.320.320.32
Phase thickness (μm) 0.250.50.50.50.5
Tstart (C) 65.60.60.60.60.
Tend (C) 250.245.245.245.245.
Heat rate (K/min) 2.3.3.3.3.
Initial hold (min) 10.3.3.3.3.
Final hold (min) 60.20.20.20.20.
I 1449.1465.1468.1472.1471.
ReferencePino, Marbot, et al., 2001Wirth, Guo, et al., 2001Wirth, Guo, et al., 2001Bureau, Baumes, et al., 2000Bureau, Razungles, et al., 2000
Comment MSDC-RI MSDC-RI MSDC-RI MSDC-RI MSDC-RI
Column type CapillaryCapillaryCapillaryCapillaryCapillary
Active phase CP-Wax 52CBDB-WaxDB-WaxDB-WaxCarbowax 20M
Column length (m) 25.60.25.60.60.
Carrier gas  N2HeHeHe
Substrate
Column diameter (mm) 0.250.250.250.250.32
Phase thickness (μm) 0.150.250.250.250.425
Tstart (C) 40.70.50.50.45.
Tend (C) 220.230.240.230.300.
Heat rate (K/min) 3.2.4.3.3.
Initial hold (min) 5.2.3. 3.
Final hold (min)  20.  20.
I 1415.1454.1429.1477.1430.
ReferenceChagonda, Makanda, et al., 2000Choi and Sawamura, 2000Möllenbeck, König, et al., 1997Shimoda, Wu, et al., 1996Mondello, Dugo, et al., 1995
Comment MSDC-RI MSDC-RI MSDC-RI MSDC-RI MSDC-RI
Column type CapillaryCapillaryCapillaryCapillaryCapillary
Active phase Carbowax 20MDB-WaxDB-WaxHP-20MHP-FFAP
Column length (m) 50.60.60.50.50.
Carrier gas He HeHeHe
Substrate
Column diameter (mm) 0.20.250.250.250.25
Phase thickness (μm) 0.20.250.25
Tstart (C) 30.50.50.60.60.
Tend (C) 170.230.230.190.210.
Heat rate (K/min) 4.2.2.3.3.
Initial hold (min) 2.
Final hold (min) 20.
I 1425.1458.1458.1420.1471.
ReferencePíry, Príbela, et al., 1995Shimoda, Shigematsu, et al., 1995Shimoda, Shigematsu, et al., 1995, 2Chung, Eiserich, et al., 1993Chung, Eiserich, et al., 1993
Comment MSDC-RI MSDC-RI MSDC-RI MSDC-RI MSDC-RI
Column type CapillaryCapillaryCapillaryCapillaryCapillary
Active phase DB-WaxDB-WaxDB-WaxCarbowax 20MCarbowax 20M
Column length (m) 30.30.30.25.25.
Carrier gas HeHeHe
Substrate
Column diameter (mm) 0.250.250.250.310.31
Phase thickness (μm)  0.250.25
Tstart (C) 40.50.50.50.50.
Tend (C) 200.220.240.200.200.
Heat rate (K/min) 2.4.4.2.2.
Initial hold (min) 10.3.3.
Final hold (min)  20.
I 1438.1431.1431.1423.1430.
ReferenceUmano, Hagi, et al., 1992Humpf and Schreier, 1991Krammer, Winterhalter, et al., 1991Suárez and Duque, 1991Suárez and Duque, 1991
Comment MSDC-RI MSDC-RI MSDC-RI MSDC-RI MSDC-RI
Column type CapillaryCapillaryCapillaryCapillaryCapillary
Active phase DB-WaxDB-WaxCarbowax 20MCarbowax 20MCarbowax 20M
Column length (m) 30.30.30.60.50.
Carrier gas HeHeHeHeHe
Substrate
Column diameter (mm) 0.250.250.250.320.32
Phase thickness (μm) 0.250.250.25
Tstart (C) 50.50.40.50.50.
Tend (C) 250.250.240.225.200.
Heat rate (K/min) 4.4.4.1.52.
Initial hold (min) 3.3.3. 5.
Final hold (min)    80.40.
I 1431.1432.1421.1435.1428.
ReferenceFröhlich, Duque, et al., 1989Fröhlich, Duque, et al., 1989Schwab, Mahr, et al., 1989Chen and Ho, 1988Chen, Kuo, et al., 1986
Comment MSDC-RI MSDC-RI MSDC-RI MSDC-RI MSDC-RI

References

Cunicao, Lopes, et al., 2007
Cunicao, M.M.; Lopes, A.R.; Côcco, L.C.; Yamamoto, C.I.; Plocharski, R.C.B.; Miguel, M.D.; Junior, A.G.; Auer, C.G.; Miguel, O.G., Phytochemical and antibacterial evaluation of essential oils from Ottonia Martiana Miq. (Piperaceae), J. Braz. Chem. Soc., 2007, 18, 1, 184-188, https://doi.org/10.1590/S0103-50532007000100021 . [all data]

Hongratanaworakit and Buchbauer, 2007
Hongratanaworakit, T.; Buchbauer, G., Chemical composition and stimulating effect of Citrus hystrix oil on humans, Flavour Fragr. J., 2007, 22, 5, 443-449, https://doi.org/10.1002/ffj.1820 . [all data]

Quijano, Salamanca, et al., 2007
Quijano, C.E.; Salamanca, G.; Pino, J.A., Aroma volatile constituents of Colombian varieties of mango (Mangifera indica L.), Flavour Fragr. J., 2007, 22, 5, 401-406, https://doi.org/10.1002/ffj.1812 . [all data]

Radulovic, Lazarevic, et al., 2007
Radulovic, N.; Lazarevic, J.; Ristic, N.; Palic, R., Chemotaxonomic significance of the volatiles in the genus Stachys (Lamiaceae): Essential oil composition of four Balkan Stachys species, Biochem. Syst. Ecol., 2007, 35, 4, 196-208, https://doi.org/10.1016/j.bse.2006.10.010 . [all data]

Saroglou, Arfan, et al., 2007
Saroglou, V.; Arfan, M.; Shabir, A.; Hadjipavlou-Litina, D.; Skaltsa, H., Composition and antioxidant activity of the essential oil of Teucrium royleanum Wall. ex Benth growing in Pakistan, Flavour Fragr. J., 2007, 22, 2, 154-157, https://doi.org/10.1002/ffj.1774 . [all data]

Telascrea, de Araujo, et al., 2007
Telascrea, M.; de Araujo, C.C.; Marques, M.O.M.; Facanali, R.; de Moraes, P.L.R.; Cavalheiro, A.J., Essential oil from leaves of Cryptocarya mandioccana Meisner (Lauraceae): Composition and intraspecific chemical variability, Biochem. Syst. Ecol., 2007, 35, 4, 222-232, https://doi.org/10.1016/j.bse.2006.09.015 . [all data]

Vagionas, Ngassapa, et al., 2007
Vagionas, K.; Ngassapa, O.; Runyoro, D.; Graikou, K.; Gortzi, O.; Chinou, I., Chemical analysis of edible aromatic plants growing in Tanzania, Food Chem., 2007, 105, 4, 1711-1717, https://doi.org/10.1016/j.foodchem.2007.05.029 . [all data]

Wu, Zorn, et al., 2007
Wu, S.; Zorn, H.; Krings, U.; Berger, R.G., Volatiles from submerged and surface-cultured beefsteak fungus, Fistulina hepatica, Flavour Fragr. J., 2007, 22, 1, 53-60, https://doi.org/10.1002/ffj.1758 . [all data]

Andrianoelisoa H.S., Menut C., et al., 2006
Andrianoelisoa H.S.; Menut C.; de Chatelperron P.C.; Saracco J.; Ramanoelina P.; Danthu P., Intraspecific chemical variability and highlighting of chemotypes of leaf essential oils from Ravensara aromatica Sonnerat a tree endemic to Madagascar, Flavour Fragr. J., 2006, 21, 5, 833-838, https://doi.org/10.1002/ffj.1735 . [all data]

Bastos, Ishimoto, et al., 2006
Bastos, D.H.M.; Ishimoto, E.; Marques, M.O.M.; Ferri, A.F.; Torres, E.A.F.S., Essential oil and antioxidant activity of green mate and mate tea (Ilex paraguariensis) infusions, J. Food Comp. Anal., 2006, 19, 6-7, 538-543, https://doi.org/10.1016/j.jfca.2005.03.002 . [all data]

Blagojevic, Radulovic, et al., 2006
Blagojevic, P.; Radulovic, N.; Palic, R.; Stojanovic, G., Chemical composition of the essential oils of Serbian wild-growing Srtemisia absinthium and Artemisia vulgaris, J. Agric. Food Chem., 2006, 54, 13, 4780-4789, https://doi.org/10.1021/jf060123o . [all data]

Bousmaha, Boti, et al., 2006
Bousmaha, L.; Boti, J.B.; Bekkara, F.A.; Castola, V.; Casanova, J., Infraspecific chemical variability of the essential oil of Lavandula dentata L. from Algeria, Flavour Fragr. J., 2006, 21, 2, 368-372, https://doi.org/10.1002/ffj.1659 . [all data]

Kuiate, Bessière, et al., 2006
Kuiate, J.R.; Bessière, J.M.; Vilarem, G.; Amvam Zollo, P.H., Chemical composition and antidermatophytic properties of the essential oils from leaves, flowers and fruits of Cupressus lusitanica Mill. from Cameroon, Flavour Fragr. J., 2006, 21, 4, 693-697, https://doi.org/10.1002/ffj.1686 . [all data]

Nath, Baruah, et al., 2006
Nath, S.C.; Baruah, A.; Kanjilal, P.B., Chemical composition of the leaf essential oil of Cinnamomum pauciflorum Nees, Flavour Fragr. J., 2006, 21, 3, 531-533, https://doi.org/10.1002/ffj.1688 . [all data]

Osorio, Alarcon, et al., 2006
Osorio, C.; Alarcon, M.; Moreno, C.; Bonilla, A.; Barrios, J.; Garzon, C.; Duque, C., Characterization of Odor-Active Volatiles in Champa ( Campomanesia lineatifolia R. P.), J. Agric. Food Chem., 2006, 54, 2, 509-516, https://doi.org/10.1021/jf052098c . [all data]

Salgueiro L.R., Pinto E., et al., 2006
Salgueiro L.R.; Pinto E.; Goncalves M.J.; Costa I.; Palmeira A.; Cavaleiro C.; Pina-Vaz C.; Rodrigues A.G.; Martinez-De-Oliveira J., Antifungal activity of the essential oil of Thymus capitellatus against Candida, Aspergillus and dermatophyte strains, Flavour Fragr. J., 2006, 21, 5, 749-753, https://doi.org/10.1002/ffj.1610 . [all data]

Saroglou, Dorizas, et al., 2006
Saroglou, V.; Dorizas, N.; Kypriotakis, Z.; Skaltsa, H.D., Analysis of the essential oil composition of eight Anthemis species from Greece, J. Chromatogr. A, 2006, 1104, 1-2, 313-322, https://doi.org/10.1016/j.chroma.2005.11.087 . [all data]

Su, Ho, et al., 2006
Su, Y.-C.; Ho, C.-L.; Wang, E.I.-C.; Chang, S.-T., Antifungal activities and chemical compositions of essential oils from leaves of four eucalypts, Taiwan J. For. Sci., 2006, 21, 1, 49-61. [all data]

Ziegenbein, Hanssen, et al., 2006
Ziegenbein, F.C.; Hanssen, H.-P.; König, W.A., Secondary metabolites from Ganoderma lucidum and Spongiporus leucomallellus, Phytochemistry, 2006, 67, 2, 202-211, https://doi.org/10.1016/j.phytochem.2005.10.025 . [all data]

Agnaniet, Makani, et al., 2005
Agnaniet, H.; Makani, T.; Akagah, A.; Menut, C.; Bessière, J.M., Volatile constituents and antioxidant activity of essential oils from Lippia multiflora Mold. growing in Gabon, Flavour Fragr. J., 2005, 20, 1, 34-38, https://doi.org/10.1002/ffj.1383 . [all data]

Alves, Pinto, et al., 2005
Alves, R.J.V.; Pinto, A.C.; da Costa, A.V.M.; Rezende, C.M., Zizyphus mauritiana Lam. (Rhamnaceae) and the chemical composition of its floral fecal odor, J. Braz. Chem. Soc., 2005, 16, 3B, 654-656, https://doi.org/10.1590/S0103-50532005000400027 . [all data]

Dob, Dahmane, et al., 2005
Dob, T.; Dahmane, D.; Berramdane, T.; Chelghoum, C., Chemical composition of the essential oil of Artemisia campestris L. from Algeria, Pharm. Biol., 2005, 43, 6, 512-514, https://doi.org/10.1080/13880200500220664 . [all data]

bin Jantan, Yalvema, et al., 2005
bin Jantan, I.; Yalvema, M.F.; Ahmad, N.W.; Jamal, J.A., Insecticidal activities of the leaf oils of eight Cinnamomum species against Aedes aegypti and Aedes albopictus, Pharm. Biol., 2005, 43, 6, 526-532, https://doi.org/10.1080/13880200500220771 . [all data]

bin Jantan, Yalvema, et al., 2005, 2
bin Jantan, I.; Yalvema, M.F.; Ayop, N.; Ahmad, A.S., Constituents of the essential oils of Cinnamomum sintoc Blume from a mountain forest of Peninsular Malaysia, Flavour Fragr. J., 2005, 20, 6, 601-604, https://doi.org/10.1002/ffj.1495 . [all data]

Pino, Mesa, et al., 2005
Pino, J.A.; Mesa, J.; Muñoz, Y.; Martí, M.P.; Marbot, R., Volatile components from mango (Mangifera indica L.) cultivars, J. Agric. Food Chem., 2005, 53, 6, 2213-2223, https://doi.org/10.1021/jf0402633 . [all data]

Antunes, Sevinate-Pinto, et al., 2004
Antunes, T.; Sevinate-Pinto, I.; Barroso, J.G.; Cavaleiro, C.; Salgueiro, L.R., Micromorphology of trichomes and composition of essential oil of Teucrium capitatum, Flavour Fragr. J., 2004, 19, 4, 336-340, https://doi.org/10.1002/ffj.1310 . [all data]

Bell, 2004
Bell, W.A.-M., Examination of Aroma Volatiles Formed from Thermal Processing of Florida Reconstituted Grapefruit Juice. A Thesis presented to the graduate school of the university of Florida in partial fulfillment of the requirements for the degree of master of science, 2004. [all data]

Cavaleiro, Salgueiro, et al., 2004
Cavaleiro, C.; Salgueiro, L.R.; Miguel, M.G.; da Cunha, A.P., Analysis by gas chromatography?mass spectrometry of the volatile components of Teucrium lusitanicum and Teucrium algarbiensis, J. Chromatogr. A, 2004, 1033, 1, 187-190, https://doi.org/10.1016/j.chroma.2004.01.005 . [all data]

Fernández-Ocaña, Gómez-Rodríguez, et al., 2004
Fernández-Ocaña, A.M.; Gómez-Rodríguez, M.V.; Velasco-Negueruela, A.; Camacho-Simarro, A.M.; Fernández-López, C.; Altarejos, J., In vivo antifungal activity of the essential oil of Bupleurum gibraltarium against plasmopara halstedii in sunflower, J. Agric. Food Chem., 2004, 52, 21, 6414-6417, https://doi.org/10.1021/jf040219n . [all data]

Flamini, Cioni, et al., 2004
Flamini, G.; Cioni, P.L.; Morelli, I.; Maccioni, S.; Baldini, R., Phytochemical typologies in some populations of Myrtus communis L. on Caprione Promontory (East Liguria, Italy), Food Chem., 2004, 85, 4, 599-604, https://doi.org/10.1016/j.foodchem.2003.08.005 . [all data]

Moldão-Martins, Beirão-da-Costa, et al., 2004
Moldão-Martins, M.; Beirão-da-Costa, S.; Neves, C.; Cavaleiro, C.; Salgueiro, L.; Beirão-da-Costa, M.L., Olive oil flavoured by the essential oils of Mentha × piperita and Thymus mastichina L., Food Qual. Pref., 2004, 15, 5, 447-452, https://doi.org/10.1016/j.foodqual.2003.08.001 . [all data]

Ngassoum, Ousmaila, et al., 2004
Ngassoum, M.B.; Ousmaila, H.; Ngamo, L.T.; Maponmetsem, P.M.; Jirovetz, L.; Buchbauer, G., Aroma compounds of essential oils of two varieties of the spice plant Ocimum canum Sims from northern Cameroon, J. Food Comp. Anal., 2004, 17, 2, 197-204, https://doi.org/10.1016/j.jfca.2003.08.002 . [all data]

Pino, Marbot, et al., 2004
Pino, J.A.; Marbot, R.; Vazquez, C., Volatile components of tamarind (Tamarindus indica L.) grown in Cuba, J. Essent. Oil Res., 2004, 16, 4, 318-320, https://doi.org/10.1080/10412905.2004.9698731 . [all data]

Salido, Valenzuela, et al., 2004
Salido, S.; Valenzuela, L.R.; Altarejos, J.; Nogueras, M.; Sánchez, A.; Cano, E., Composition and infraspecific variability of Artemisia herba-alba from southern Spain, Biochem. Syst. Ecol., 2004, 32, 3, 265-277, https://doi.org/10.1016/j.bse.2003.09.002 . [all data]

Tam, Thuam, et al., 2004
Tam, N.T.; Thuam, D.T.; Bighelli, A.; Castola, V.; Muselli, A.; Richomme, P.; Casanova, J., Baeckea frutescens leaf oil from Vietnam: composition and chemical variability, Flavour Fragr. J., 2004, 19, 3, 217-220, https://doi.org/10.1002/ffj.1281 . [all data]

bin Ahmad and bin Jantan, 2003
bin Ahmad, F.; bin Jantan, I., Chemical constituents of the essential oils of Goniothalamus uvariodes King, Flavour Fragr. J., 2003, 18, 2, 128-130, https://doi.org/10.1002/ffj.1142 . [all data]

Bicchi, Rubiolo, et al., 2003
Bicchi, C.; Rubiolo, P.; Camargo, E.E.S.; Vilegas, W.; Gracioso, J.S.; Brito, A.R.M.S., Components of Turnera diffusa Willd. var. afrodisiaca (Ward) Urb. essential oil, Flavour Fragr. J., 2003, 18, 1, 59-61, https://doi.org/10.1002/ffj.1155 . [all data]

Ceva-Antunes, Bizzo, et al., 2003
Ceva-Antunes, P.M.N.; Bizzo, H.R.; Alves, S.M.; Antunes, O.A.C., Analysis of volatile compounds of taperebá (Spondias mombin L.) and Cajá (Spondias mombin L.) by simultaneous distillation and extraction (SDE) and solid phase microextraction (SPME), J. Agric. Food Chem., 2003, 51, 5, 1387-1392, https://doi.org/10.1021/jf025873m . [all data]

Chisholm, Jell, et al., 2003
Chisholm, M.G.; Jell, J.A.; Cass, D.M., Jr., Characterization of the major odorants found in the peel oil of Citrus reticulata Blanco cv. Clementine using gas chromatography-olfactometry, Flavour Fragr. J., 2003, 18, 4, 275-281, https://doi.org/10.1002/ffj.1188 . [all data]

Choi, 2003
Choi, H.-S., Character impact odorants of Citrus Hallabong [(C. unshiu Marcov × C. sinensis Osbeck) × C. reticulata Blanco] cold-pressed peel oil, J. Agric. Food Chem., 2003, 51, 9, 2687-2692, https://doi.org/10.1021/jf021069o . [all data]

Jantan, Ling, et al., 2003
Jantan, I.; Ling, Y.E.; Romli, S.; Ayop, N.; Ahmad, A.S., A comparative study of the constituents of the essential oils of three Cinnamomum species from Malaysia, J. Essent. Oil Res., 2003, 15, 6, 387-391, https://doi.org/10.1080/10412905.2003.9698618 . [all data]

bin Jantan, Yassin, et al., 2003
bin Jantan, I.; Yassin, M.S.M.; Chin, C.B.; Chen, L.L.; Sim. N.L., Antifungal activity of the essential oils of nine Zingiberaceae species, Pharm. Biol., 2003, 41, 5, 392-397, https://doi.org/10.1076/phbi.41.5.392.15941 . [all data]

Karioti, Skaltsa, et al., 2003
Karioti, A.; Skaltsa, H.; Demetzos, C.; Perdetzoglou, D.; Economakis, C.D.; Salem, A.B., Effect of nitrogen concentration of the nutrient solution on the volatile constituents of leaves of Salvia fruticosa Mill. in solution culture, J. Agric. Food Chem., 2003, 51, 22, 6505-6508, https://doi.org/10.1021/jf030308k . [all data]

Lalel, Singh, et al., 2003
Lalel, H.J.D.; Singh, Z.; Chye Tan, S., Glycosidically-bound aroma volatile compounds in the skin and pulp of 'Kensington Pride' mango fruit at different stages of maturity, Postharvest Biol. Technol., 2003, 29, 2, 205-218, https://doi.org/10.1016/S0925-5214(02)00250-8 . [all data]

Macchioni, Cioni, et al., 2003
Macchioni, F.; Cioni, P.L.; Flamini, G.; Morelli, I.; Maccioni, S.; Ansaldi, M., Chemical composition of essential oils from needles, branches and cones of Pinus pinea, P. halepensis, P. pinaster and P. nigra from central Italy, Flavour Fragr. J., 2003, 18, 2, 139-143, https://doi.org/10.1002/ffj.1178 . [all data]

Pino, Almora, et al., 2003
Pino, J.; Almora, K.; Marbot, R., Volatile components of papaya (Carica papaya L., maradol variety) fruit, Flavour Fragr. J., 2003, 18, 6, 492-496, https://doi.org/10.1002/ffj.1248 . [all data]

Pino, Marbot, et al., 2003
Pino, J.; Marbot, R.; Rosado, A.; Vázquez, C., Volatile constituents of fruits of Garcinia dulcis Kurz. from Cuba, Flavour Fragr. J., 2003, 18, 4, 271-274, https://doi.org/10.1002/ffj.1187 . [all data]

Shellie and Marriott, 2003
Shellie, R.A.; Marriott, P.J., Comprehensive two-dimensional gas chromatography-mass spectrometry analysis of Pelargonium graveolens essential oil using rapid scanning quadrupole mass spectrometry, Analyst, 2003, 128, 7, 879-883, https://doi.org/10.1039/b304371a . [all data]

Verzera, Trozzi, et al., 2003
Verzera, A.; Trozzi, A.; Gazea, F.; Cicciarelloi, G.; Cotroneo, A., Effects of rootstock on the composition of bergamot (Citrus bergamia Risso et Poiteau) essential oil, J. Agric. Food Chem., 2003, 51, 1, 206-210, https://doi.org/10.1021/jf0206872 . [all data]

Flamini, Cioni, et al., 2002
Flamini, G.; Cioni, P.L.; Morelli, I., Differences in the fragrances of pollen and different floral parts of male and female flowers of Laurus nobilis, J. Agric. Food Chem., 2002, 50, 16, 4647-4652, https://doi.org/10.1021/jf020269x . [all data]

Javidnia, Miri, et al., 2002
Javidnia, K.; Miri, R.; Kamalinejad, M.; Nasiri, A., Composition of the essential oil of Salvia mirzayanii Rech. f. Esfand from Iran, Flavour Fragr. J., 2002, 17, 6, 465-467, https://doi.org/10.1002/ffj.1128 . [all data]

Lota, de Rocca Serra, et al., 2002
Lota, M.-L.; de Rocca Serra, D.; Tomi, F.; Jacquemond, C.; Casanova, J., Volatile components of peel and leaf oils of lemon and lime species, J. Agric. Food Chem., 2002, 50, 4, 796-805, https://doi.org/10.1021/jf010924l . [all data]

Mondello, Zappia, et al., 2002
Mondello, L.; Zappia, G.; Cotroneo, A.; Bonaccorsi, I.; Chowdhury, J.U.; Yusuf, M.; Dugo, G., Studies on the essential oil-bearing plants of Bangladesh. Part VIII. Composition of some Ocimum oils O. basilicum L. var. purpurascens; O. sanctum L. green; O. sanctum L. purple; O. americanum L., citral type; O. americanum L., camphor type, Flavour Fragr. J., 2002, 17, 5, 335-340, https://doi.org/10.1002/ffj.1108 . [all data]

Pino, Marbot, et al., 2002
Pino, J.A.; Marbot, R.; Bello, A., Volatile compounds of Psidium salutare (H.B.K.) Berg. fruit, J. Agric. Food Chem., 2002, 50, 18, 5146-5148, https://doi.org/10.1021/jf0116303 . [all data]

Pino, Marbot, et al., 2002, 2
Pino, J.A.; Marbot, R.; Vázquez, C., Characterization of volatile in Cosa Rican Guava [Psidium friedrichsthalianum (Berg) Niedenzu] fruit, J. Agric. Food Chem., 2002, 50, 21, 6023-6026, https://doi.org/10.1021/jf011456i . [all data]

Pitarokili, Couladis, et al., 2002
Pitarokili, D.; Couladis, M.; Petsikos-Panayotarou, N.; Tzakou, O., Composition and antifungal activity on soil-borne pathogens of the essential oil of Salvia sclarea from Greece, J. Agric. Food Chem., 2002, 50, 23, 6688-6691, https://doi.org/10.1021/jf020422n . [all data]

Shellie, Mondello, et al., 2002
Shellie, R.; Mondello, L.; Marriott, P.; Dugo, G., Characterisation of lavender essential oils by using gas chromatography-mass spectrometry with correlation of linear retention indices and comparison with comprehensive two-dimensional gas chromatography, J. Chromatogr. A, 2002, 970, 1-2, 225-234, https://doi.org/10.1016/S0021-9673(02)00653-2 . [all data]

Chisholm, Wilson, et al., 2001
Chisholm, M.G.; Wilson, M.A.; Gaskey, G.M.; Jell, J.A.; Cass, D.M., Jr., Chapter 9. The identification of aroma compounds in key lime oil using solid-phase microextraction and gas chromatography-olfactometry, Am. Chem. Soc. Symp. Ser., 2001, 782, 100-112. [all data]

Couladis, Tsortanidou, et al., 2001
Couladis, M.; Tsortanidou, V.; Francisco-Ortega, J.; Santos-Guerra, A.; Harvala, C., Composition of the essential oils of Argyranthemum species growing in the Canary Islands, Flavour Fragr. J., 2001, 16, 2, 103-106, https://doi.org/10.1002/ffj.954 . [all data]

Giamakis, Kretsi, et al., 2001
Giamakis, A.; Kretsi, O.; Chinou, I.; Spyropoulos, C.G., Eucalyptus camaldulensis: volatiles from immature flowers and high production of 1,8-cineole and β-pinene by in vitro cultures, Phytochemistry, 2001, 58, 2, 351-355, https://doi.org/10.1016/S0031-9422(01)00193-5 . [all data]

bin Jantan, Basni, et al., 2001
bin Jantan, I.; Basni, I.; Ahmad, A.S.; Ali, N.A.M.; Ahmad, A.R.; Ibrahim, H., Constituents of the rhizome oils of Boesenbergia pandurata (Roxb.) Schlecht from Malaysia, Indonesia and Thailand, Flavour Fragr. J., 2001, 16, 2, 110-112, https://doi.org/10.1002/ffj.956 . [all data]

Lota, Serra, et al., 2001
Lota, M.-L.; Serra, D.R.; Jacquemond, C.; Tomi, F.; Casanova, J., Chemical variability of peel and leaf essential oils of sour orange, Flavour Fragr. J., 2001, 16, 2, 89-96, https://doi.org/10.1002/1099-1026(200103/04)16:2<89::AID-FFJ950>3.0.CO;2-D . [all data]

Pino and Marbot, 2001
Pino, J.A.; Marbot, R., Volatile flavor constituents of acerola (Malpighia emarginata DC.) fruit, J. Agric. Food Chem., 2001, 49, 12, 5880-5882, https://doi.org/10.1021/jf010270g . [all data]

Pino, Marbot, et al., 2001
Pino, J.A.; Marbot, R.; Vázquez, C., Characterization of volatiles in strawberry guava (Psidium cattleianum Sabine) fruit, J. Agric. Food Chem., 2001, 49, 12, 5883-5887, https://doi.org/10.1021/jf010414r . [all data]

Salido, Altarejos, et al., 2001
Salido, S.; Altarejos, J.; Nogueras, M.; Sánchez, A., Chemical composition of the essential oil of Artemisia herba-alba Asso ssp. valentina (Lam.) Marcl., J. Essent. Oil Res., 2001, 13, 4, 221-224, https://doi.org/10.1080/10412905.2001.9699675 . [all data]

Alonzo, Bosco, et al., 2000
Alonzo, G.; Bosco, S.F.D.; Palazzolo, E.; Saiano, F.; Tusa, N., Citrus somatic hybrid leaf essential oil, Flavour Fragr. J., 2000, 15, 4, 258-262, https://doi.org/10.1002/1099-1026(200007/08)15:4<258::AID-FFJ906>3.0.CO;2-F . [all data]

Brat, Brillouet, et al., 2000
Brat, P.; Brillouet, J.-M.; Reynes, M.; Cogat, P.-O.; Ollé, D., Free volatile components of passion fruit puree obtained by flash vacuum-expansion, J. Agric. Food Chem., 2000, 48, 12, 6210-6214, https://doi.org/10.1021/jf000645i . [all data]

Song, Sawamura, et al., 2000
Song, H.S.; Sawamura, M.; Ito, T.; Kawashimo, K.; Ukeda, H., Quantitative determination of characteric flavour of Citrus junos (yuzu) peel oil, Flavour Fragr. J., 2000, 15, 4, 245-250, https://doi.org/10.1002/1099-1026(200007/08)15:4<245::AID-FFJ904>3.0.CO;2-V . [all data]

Yassaa, Meklati, et al., 2000
Yassaa, N.; Meklati, B.Y.; Cecinato, A., Evaluation of monoterpenic biogenic volatile organic compounds in ambient air around Eucalyptus globulus, Pinus halepensis and Cedrus atlantica trees growing in Algiers city area by chiral and achiral capillary gas chromatography, Atmos. Environ., 2000, 34, 17, 2809-2816, https://doi.org/10.1016/S1352-2310(99)00436-7 . [all data]

Chen, Huang, et al., 1998
Chen, S.-H.; Huang, T.-C.; Ho, C.-T.; Tsai, P.-J., Extraction, analysis, and study on the volatiles in roselle tea, J. Agric. Food Chem., 1998, 46, 3, 1101-1105, https://doi.org/10.1021/jf970720y . [all data]

Tam, An, et al., 1998
Tam, N.T.; An, H.L.; Muselli, a.; Bighelli, A.; Casanova, J., Essential oil of an unidentified Illicium species from Ninh Binh Province, Vietnam, Flavour Fragr. J., 1998, 13, 6, 393-396, https://doi.org/10.1002/(SICI)1099-1026(199811/12)13:6<393::AID-FFJ764>3.0.CO;2-R . [all data]

Sakho, Chassagne, et al., 1997
Sakho, M.; Chassagne, D.; Crouzet, J., African mango glycosidically bound volatile compounds, J. Agric. Food Chem., 1997, 45, 3, 883-888, https://doi.org/10.1021/jf960277b . [all data]

Píry, Príbela, et al., 1995
Píry, J.; Príbela, A.; Durcanská, J.; Farkas, P., Fractionation of volatiles from blackcurrant (Ribes nigrum L.) by different extractive methods, Food Chem., 1995, 54, 1, 73-77, https://doi.org/10.1016/0308-8146(95)92665-7 . [all data]

Chung, Eiserich, et al., 1993
Chung, T.Y.; Eiserich, J.P.; Shibamoto, T., Volatile compounds isolated from edible Korean chamchwi (Aster scaber Thunb), J. Agric. Food Chem., 1993, 41, 10, 1693-1697, https://doi.org/10.1021/jf00034a033 . [all data]

Yang, Sugisawa, et al., 1992
Yang, R.; Sugisawa, H.; Nakatani, H.; Tamura, H.; Takagi, N., Comparison of odor quality in peel oils of acid citrus, Nippon Shokuhin Kogyo Gakkaishi, 1992, 39, 1, 16-24, https://doi.org/10.3136/nskkk1962.39.16 . [all data]