Morpholine, 4-nitroso-

Condensed phase thermochemistry data

Data compiled by: Hussein Y. Afeefy, Joel F. Liebman, and Stephen E. Stein

Quantity Value Units Method Reference Comment
Δfliquid-33.0 ± 0.5kcal/molCcbGolovanova, Sitonina, et al., 1988
Quantity Value Units Method Reference Comment
Δcliquid-616.5 ± 0.5kcal/molCcbGolovanova, Sitonina, et al., 1988

References

Golovanova, Sitonina, et al., 1988
Golovanova, O.F.; Sitonina, G.V.; Pepekin, v.I.; Korsunskii, B.L.; Dubovitskii, F.I., Kinetic and thermochemical studies of N-nitro and N-nitrosomorpholine, Bull. Acad. Sci. USSR, Div. Chem. Sci., 1988, 881-886. [all data]