2,4-Dioxabicyclo[3.2.2]non-6-ene,1-methyl-5-(1-methylethyl)-

Gas phase ion energetics data

Data compiled by: Sharon G. Lias, Rhoda D. Levin, and Sherif A. Kafafi

Ionization energy determinations

IE (eV) Method Reference Comment
9.31PEBrown, 1976Vertical value

References

Brown, 1976
Brown, R.S., The influence of remote substituents upon ionization potential. Part I. The effect of two allylic oxygens upon the ionization of the π-bond, Can. J. Chem., 1976, 54, 805. [all data]