Propane, 1,1-dichloro-2-methyl-

Normal alkane RI, non-polar column, custom temperature program

Data compiled by: NIST Mass Spectrometry Data Center, William E. Wallace, director

Column type CapillaryCapillary
Active phase Polydimethyl siloxanesMethyl Silicone
Column length (m)
Carrier gas
Substrate
Column diameter (mm)
Phase thickness (μm)
Program not specifiednot specified
I 727.727.
ReferenceZenkevich, 2003Zenkevich and Marinichev, 2001
Comment MSDC-RI MSDC-RI

Reaction thermochemistry data

Data compiled by: Hussein Y. Afeefy, Joel F. Liebman, and Stephen E. Stein

Individual Reactions

Propane, 1,1-dichloro-2-methyl- = Propane, 1,2-dichloro-2-methyl-

By formula: C4H8Cl2 = C4H8Cl2

Quantity Value Units Method Reference Comment
Δr-4.15 ± 0.60kcal/molEqkSharonov, Plaksina, et al., 1975liquid phase; AlCl3

References

Zenkevich, 2003
Zenkevich, I.G., Criteria for Evaluation of Elution Order of Isomeric Organic Compounds, Zh. Phys. Khim. (Rus.), 2003, 77, 1, 92-98. [all data]

Zenkevich and Marinichev, 2001
Zenkevich, I.G.; Marinichev, A.N., Comparison of Topological and Dynamics Molecular Characteristics for Precalculation of Chromatographic Retention Parameters of Organic Compounds (in Russian), Zh. Struct. Khim., 2001, 42, 5, 893-902. [all data]