Nitrofurazone

Condensed phase thermochemistry data

Data compiled by: Hussein Y. Afeefy, Joel F. Liebman, and Stephen E. Stein

Quantity Value Units Method Reference Comment
Δfsolid-223.6 ± 1.3kJ/molCcbBalepin, Lebedev, et al., 1980Reanalyzed by Pedley, Naylor, et al., 1986, Original value = -226. ± 1. kJ/mol
Quantity Value Units Method Reference Comment
Δcsolid-2995. ± 1.kJ/molCcbBalepin, Lebedev, et al., 1980

References

Balepin, Lebedev, et al., 1980
Balepin, A.A.; Lebedev, V.P.; Kuznetsova, A.A.; Venter, K.K.; Trushule, M.A.; Lolya, D.O.; Lebedev, Yu.A., Thermochemical properties of α-nitro derivatives of furan, Bull. Acad. Sci. USSR, Div. Chem. Sci., 1980, 601-604. [all data]

Pedley, Naylor, et al., 1986
Pedley, J.B.; Naylor, R.D.; Kirby, S.P., Thermochemical Data of Organic Compounds, Chapman and Hall, New York, 1986, 1-792. [all data]

Lang (editor), 1963
Lang (editor), L., Absorption Spectra in theUltraviolet and Visible Region, 1963, 4, 189. [all data]