Patchouli alcohol

Kovats' RI, non-polar column, temperature ramp

Data compiled by: NIST Mass Spectrometry Data Center, William E. Wallace, director

Column type Capillary
Active phase HP-1
Column length (m) 60.
Carrier gas He
Substrate
Column diameter (mm) 0.25
Phase thickness (μm) 0.25
Tstart (C) 60.
Tend (C) 200.
Heat rate (K/min) 4.
Initial hold (min) 5.
Final hold (min) 25.
I 1654.
ReferenceMeccia G., Rosquete C., et al., 2006
Comment MSDC-RI

Normal alkane RI, non-polar column, temperature ramp

Data compiled by: NIST Mass Spectrometry Data Center, William E. Wallace, director

Column type CapillaryCapillaryCapillaryCapillaryCapillary
Active phase HP-5 MSHP-5 MSOV-1DB-1HP-5 MS
Column length (m) 30.30.30.30.30.
Carrier gas Helium HeliumHeliumHelium
Substrate
Column diameter (mm) 0.250.250.250.250.25
Phase thickness (μm) 0.250.250.250.250.25
Tstart (C) 60.60.50.50.60.
Tend (C) 230.300.250.220.300.
Heat rate (K/min) 3.15.5.4.15.
Initial hold (min)  2.3.2.2.
Final hold (min)  10.2.2.10.
I 1666.1657.1639.1665.1657.
ReferencePripdeevech and Saansoomchai, 2013Xu, Han, et al., 2012Hu, Liang, et al., 2010Xu, Tang, et al., 2010Xu, Han, et al., 2009
Comment MSDC-RI MSDC-RI MSDC-RI MSDC-RI MSDC-RI
Column type CapillaryCapillaryCapillaryCapillaryCapillary
Active phase HP-5BP-1DB-1HP-5HP-5
Column length (m) 60.50.30.30.30.
Carrier gas He HeHeliumHe
Substrate
Column diameter (mm) 0.250.220.250.320.25
Phase thickness (μm) 0.250.250.25 0.25
Tstart (C) 60.60.60.70.40.
Tend (C) 250.220.250.210.240.
Heat rate (K/min) 3.2.5.2.3.
Initial hold (min)   5. 5.
Final hold (min)  20.15.60.
I 1683.1657.1665.1659.1664.
ReferenceBertrand, Comte, et al., 2006Boti, Yao, et al., 2006Facundo, Pinto, et al., 2005Mookdasanit, Tamura, et al., 2003Novak, Novak, et al., 2000
Comment MSDC-RI MSDC-RI MSDC-RI MSDC-RI MSDC-RI
Column type CapillaryCapillaryCapillaryCapillary
Active phase CP Sil 5 CBCP Sil 5 CBCP Sil 5 CBOV-101
Column length (m) 25.25.25.50.
Carrier gas N2N2HeN2
Substrate
Column diameter (mm) 0.320.320.250.25
Phase thickness (μm) 0.250.250.25
Tstart (C) 50.50.60.80.
Tend (C) 290.290.300.200.
Heat rate (K/min) 4.4.6.2.
Initial hold (min)
Final hold (min)
I 1625.1625.1625.1651.
ReferenceBos, Woerdenbag, et al., 1997Bos, Woerdenbag, et al., 1997Bos, Woerdenbag, et al., 1997, 2Sugisawa, Yamamoto, et al., 1989
Comment MSDC-RI MSDC-RI MSDC-RI MSDC-RI

References

Meccia G., Rosquete C., et al., 2006
Meccia G.; Rosquete C.; Rojas L.B.; San Felician A., New labdane derivative from the essential oil of Acalypha plicata Mull.Arg., Flavour Fragr. J., 2006, 21, 3, 559-561, https://doi.org/10.1002/ffj.1679 . [all data]