1,7-Octadien-3-ol, 3,7-dimethyl-

Normal alkane RI, polar column, custom temperature program

Data compiled by: NIST Mass Spectrometry Data Center, William E. Wallace, director

Column type Capillary
Active phase DB-Wax
Column length (m) 30.
Carrier gas Helium
Substrate
Column diameter (mm) 0.25
Phase thickness (μm) 0.25
Program not specified
I 1562.
ReferenceZeng, Xie, et al., 2011
Comment MSDC-RI

References

Zeng, Xie, et al., 2011
Zeng, Z.; Xie, R.; Zhang, T.; Zhang, H.; Chen, J.Y., Analysis of volatile compositions of Magnolia biondii Pamp by steam distillation and Headspace solid phase micro-extraction, J. Oleo Sci., 2011, 60, 12, 591-596, https://doi.org/10.5650/jos.60.591 . [all data]