Pyridinium,4-cyano-1-benzoyl-2-oxo-2-phenylethylide

Gas phase ion energetics data

Data compiled by: Sharon G. Lias, Rhoda D. Levin, and Sherif A. Kafafi

Ionization energy determinations

IE (eV) Method Reference
7.94CTSKokars, Kampars, et al., 1975

References

Kokars, Kampars, et al., 1975
Kokars, V.; Kampars, V.; Neilands, O., Characteristics of π-electron structure of betainelike active methylene group derivatives. VII. Electron absortion spectra and electron-donor properties of the series of β-diketone onium betaines, Latv. PSR Zinat. Akad. Vestis Kim. Ser., 1975, 6, 734. [all data]