2H-Dibenz[e,g]isoindole,2-methyl-

Gas phase ion energetics data

Data compiled by: Sharon G. Lias, Rhoda D. Levin, and Sherif A. Kafafi

Ionization energy determinations

IE (eV) Method Reference Comment
7.15PERettig and Wirz, 1976Vertical value

References

Rettig and Wirz, 1976
Rettig, W.; Wirz, J., 111. Electronic structure and photophysical properties of isoindole and its benzo[f]-and dibenzo[e,g]-derivatives, Helv. Chim. Acta, 1976, 59, 1054. [all data]